program: Orca
programVersion: 5.0.4
elementType: N Se N C O H H H H H H
charge: 0
multiplicity: 1
keywords: SP DSD-BLYP D3BJ def2-QZVPP def2-QZVPP/C def2/J TightSCF
formula: CH6N2OSe
InChI: InChI=1/CH6N2OSe/c1-3-5(2)4/h3H,2H2,1H3
11 atoms
N  1.509603 -0.313439 0.851214
Se 0.27171 0.308808 -0.345169
N  -1.12069 0.525318 0.848069
C  -1.787193 -0.69052 1.288207
O  -0.039911 -1.003917 -1.224239
H  1.486004 0.171413 1.741041
H  1.416239 -1.315103 0.985655
H  -1.782328 1.201077 0.480427
H  -2.234478 -1.278856 0.483648
H  -1.079065 -1.328905 1.816752
H  -2.566183 -0.421577 2.000922
totalener: -2626.61326718 hartree
nucrepener: 411.05008023 hartree
electener: -3037.66334741 hartree
oneelecener: -4468.43101147 hartree
twoeener: 1430.76766406 hartree
kineticenergy: 2624.36078896 hartree
exchangeener: -35.504263045430 hartree
correlationener: -1.520878740830 hartree
xcener: -37.025141786260 hartree
chargesum: 0.0000000
charge: -0.557854 1.050685 -0.513826 -0.028660 -0.705539 0.178368 0.203014 0.152265 0.102396 0.050238 0.068912
charge: 0.341573 0.711548 0.207321 0.061261 -0.361000 -0.245166 -0.242955 -0.252086 -0.075516 -0.074309 -0.070671
qa: -0.5579 1.0507 -0.5138 -0.0287 -0.7055 0.1784 0.2030 0.1523 0.1024 0.0502 0.0689
va: 2.9028 3.6307 2.8157 3.8873 1.7485 1.0273 1.0234 1.0260 0.9877 1.0025 0.9882
total: -2627.336708349 hartree
dispersion: -0.006884306 hartree
energy: -2627.343592655414 hartree
dipole: -7.25919 6.78342 -0.47577 -5.97872 6.71735 0.73863 10.58644 -9.34180 1.24464
magnitude: 1.52350 au
magnitude: 3.87244 debye
