program: Orca
programVersion: 5.0.4
elementType: N Se N C H H H H H H
charge: 2
multiplicity: 1
keywords: Freq RIJCOSX PBEh-3c
frequency: 0.00 0.00 0.00 0.00 0.00 0.00 160.01 177.42 217.46 385.54 420.11 649.48 752.69 787.48 898.52 985.75 1012.20 1110.47 1172.43 1426.03 1468.30 1478.53 1526.62 1636.00 3091.88 3194.34 3241.51 3421.71 3455.30 3538.71
frequency: 160.01 177.42 217.46 385.54 420.11 649.48 752.69 787.48 898.52 985.75 1012.20 1110.47 1172.43 1426.03 1468.30 1478.53 1526.62 1636.00 3091.88 3194.34 3241.51 3421.71 3455.30 3538.71
formula: CH6N2Se
InChI: InChI=1/CH6N2Se/c1-3-4-2/h3H,2H2,1H3
10 atoms
N  2.323477 0.151915 0.115684
Se 0.828296 0.588073 0.801611
N  -0.364189 -0.140341 -0.158015
C  -1.817456 -0.00297 0.102604
H  2.479646 -0.429905 -0.716331
H  3.182332 0.501012 0.56351
H  -0.121985 -0.713773 -0.978409
H  -2.219537 -1.009697 0.240171
H  -2.266562 0.448147 -0.785745
H  -2.024022 0.607639 0.979722
totalener: -2550.52666042 hartree
nucrepener: 292.18184967 hartree
electener: -2842.70851008 hartree
oneelecener: -4097.84493405 hartree
twoeener: 1255.13642396 hartree
kineticenergy: 2547.72821394 hartree
exchangeener: -59.492427262236 hartree
correlationener: -3.181975735551 hartree
xcener: -62.674402997787 hartree
energy: -12411.3713 -1614.5171 -1449.6804 -1449.6676 -1449.6412 -413.0864 -412.2617 -295.5149 -237.2724 -179.7869 -179.7193 -179.6397 -77.8745 -77.8436 -77.8349 -77.6997 -77.6922 -41.8234 -39.5381 -34.0421 -31.5622 -29.2079 -28.2595 -25.5895 -25.3585 -24.7821 -23.4061 -22.8649 -20.7906 -15.1434 -11.4712 -10.5593 -7.5340 -6.1529 -5.3591 -4.8446 -4.6401 -3.9353 -3.7175 -3.1485 0.0692 0.6002 1.2659 2.4947 2.9365 2.9837 4.3512 5.3527 5.9757 8.0343 9.4535 10.3862 11.4231 12.0820 14.4860 14.7549 15.2810 17.2244 17.9530 17.9783 18.6275 19.2225 20.3815 22.1500 26.5330 29.3841 29.5668 33.3101 36.9536 38.5492 40.8677 43.3622 46.3020 47.9728 48.2948 49.2835 51.5026 53.0763 53.1011 55.7559 60.9362 72.6986 73.2747 76.1563 78.7544 80.5030 362.3555 503.5312 506.6444 electronvolt
chargesum: 2.0000000
charge: -0.804263 1.371912 -0.625370 -0.530878 0.505304 0.521321 0.499169 0.369427 0.369303 0.324076
charge: -0.362156 1.157091 -0.200126 -0.230819 0.337769 0.352823 0.334536 0.212288 0.212190 0.186403
qa: -0.8043 1.3719 -0.6254 -0.5309 0.5053 0.5213 0.4992 0.3694 0.3693 0.3241
va: 3.0236 3.0081 3.1602 3.3886 0.7363 0.7181 0.7320 0.8368 0.8367 0.8706
dispersion: -0.003693881 hartree
energy: -2550.508629182209 hartree
dipole: -6.81712 7.00786 0.19075 -4.90112 4.14311 -0.75800 -6.55045 5.46701 -1.08344
magnitude: 1.33596 au
magnitude: 3.39574 debye
temp: 298.15 k
press: 1.00 atm
zeropoint: 0.08248903 hartree
thermalvibcorrection: 0.00287695 hartree
thermalrotcorrection: 0.00141627 hartree
thermaltrasncorrection: 0.00141627 hartree
thermaltotal: -2550.42043067 hartree
thermalcorr: 0.00570949 hartree
nonthermalcorr: 0.08248903 hartree
totalcorr: 0.08819852 hartree
thermalcorrenthalpy: 0.00094421 hartree
totalenthalpy: -2550.41948646 hartree
vibrat: 0.00480326 hartree
rotat: 0.01205239 hartree
transl: 0.01918765 hartree
total: 0.03604329 hartree
totalentropycorr: -0.03604329 hartree
gibbsenthalpy: -2550.45552975 hartree
gibbsminuselec: 0.05309943 hartree
