program: Orca
programVersion: 5.0.4
elementType: C N Se F N C H H H H H H H H
charge: 1
multiplicity: 1
keywords: Freq RIJCOSX PBEh-3c
frequency: 0.00 0.00 0.00 0.00 0.00 0.00 56.93 72.53 135.21 152.00 181.67 272.64 298.88 327.09 420.13 462.27 524.00 718.29 742.86 793.42 1085.94 1108.90 1166.60 1169.71 1174.89 1195.42 1451.71 1479.92 1514.01 1518.22 1538.47 1548.95 1554.68 1564.40 3135.96 3136.48 3229.62 3232.12 3246.57 3248.68 3607.01 3620.54
frequency: 56.93 72.53 135.21 152.00 181.67 272.64 298.88 327.09 420.13 462.27 524.00 718.29 742.86 793.42 1085.94 1108.90 1166.60 1169.71 1174.89 1195.42 1451.71 1479.92 1514.01 1518.22 1538.47 1548.95 1554.68 1564.40 3135.96 3136.48 3229.62 3232.12 3246.57 3248.68 3607.01 3620.54
formula: C2H8FN2Se
InChI: InChI=1/C2H8FN2Se/c1-4-6(3)5-2/h4-5H,1-2H3
14 atoms
C  2.443097 -0.492764 0.253287
N  0.976595 -0.387897 0.191313
Se 0.250684 1.150397 -0.166065
F  0.132682 1.865278 1.40602
N  -1.395429 0.685686 -0.468247
C  -2.185675 -0.21602 0.373094
H  2.851633 -0.153116 1.203382
H  2.695634 -1.539502 0.106367
H  2.900534 0.065735 -0.561689
H  0.474602 -1.016199 0.811586
H  -1.914943 1.398436 -0.969492
H  -1.770041 -1.221452 0.352936
H  -3.17726 -0.276384 -0.066541
H  -2.281915 0.137702 1.398849
totalener: -2689.92973329 hartree
nucrepener: 529.49768644 hartree
electener: -3219.42741973 hartree
oneelecener: -4775.23379641 hartree
twoeener: 1555.80637667 hartree
kineticenergy: 2686.14253628 hartree
exchangeener: -68.623934660988 hartree
correlationener: -4.000873109869 hartree
xcener: -72.624807770857 hartree
energy: -12404.7135 -1607.7613 -1442.9572 -1442.9110 -1442.8749 -688.1240 -404.9722 -404.9323 -289.8409 -289.7171 -230.5272 -173.0644 -173.0066 -172.8504 -71.1981 -71.1714 -71.0104 -70.9722 -70.9143 -40.9194 -34.4887 -32.7804 -27.9855 -26.0672 -24.7994 -22.0205 -21.5014 -20.3874 -19.5102 -19.2968 -18.5124 -18.3665 -18.1756 -17.5369 -16.8065 -16.2376 -14.7196 -14.0101 -5.4148 -4.9381 -3.2693 -1.3910 -0.7947 0.4259 0.7803 0.9697 1.1232 1.3844 1.6664 1.8463 2.3455 3.7577 6.0021 7.0588 7.4073 8.4902 8.6771 9.2163 9.7823 10.1210 10.5024 10.9756 12.7070 14.2478 15.9998 16.2794 18.7300 19.5421 19.8039 21.3497 22.0431 22.2426 22.6355 23.0710 23.2934 23.8765 24.1941 24.8898 25.8053 25.9790 26.4955 28.0178 29.3893 29.5054 30.0260 30.3521 30.9937 34.1336 34.7649 35.7783 36.0892 37.4002 38.6465 42.3901 43.0929 44.7637 48.9071 49.5126 50.0660 50.3764 51.2210 51.4057 55.8445 57.2343 58.4677 58.9983 60.4256 60.8389 61.3546 62.3356 66.1036 67.9583 68.8232 83.8045 83.9525 85.1321 87.5385 88.1124 368.4433 368.6958 513.8982 516.3008 883.2194 electronvolt
chargesum: 1.0000000
charge: -0.520725 -0.741179 1.390051 -0.411934 -0.734231 -0.526869 0.278022 0.298258 0.270128 0.423367 0.431077 0.260996 0.303081 0.279959
charge: -0.261420 -0.375719 1.089432 -0.313560 -0.376218 -0.268491 0.147002 0.167072 0.153024 0.280572 0.291468 0.144574 0.172782 0.149483
qa: -0.5207 -0.7412 1.3901 -0.4119 -0.7342 -0.5269 0.2780 0.2983 0.2701 0.4234 0.4311 0.2610 0.3031 0.2800
va: 3.5820 2.9039 3.3073 0.9519 2.9107 3.5902 0.8807 0.8818 0.8941 0.7974 0.7872 0.8948 0.8839 0.8826
dispersion: -0.006224287 hartree
energy: -2689.903356088407 hartree
dipole: -2.46029 2.08629 -0.37400 -13.21401 12.35721 -0.85680 2.99589 -3.31043 -0.31455
magnitude: 0.98637 au
magnitude: 2.50714 debye
temp: 298.15 k
press: 1.00 atm
zeropoint: 0.11547281 hartree
thermalvibcorrection: 0.00596668 hartree
thermalrotcorrection: 0.00141627 hartree
thermaltrasncorrection: 0.00141627 hartree
thermaltotal: -2689.77908406 hartree
thermalcorr: 0.00879922 hartree
nonthermalcorr: 0.11547281 hartree
totalcorr: 0.12427203 hartree
thermalcorrenthalpy: 0.00094421 hartree
totalenthalpy: -2689.77813985 hartree
vibrat: 0.01060190 hartree
rotat: 0.01322659 hartree
transl: 0.01951960 hartree
total: 0.04334808 hartree
totalentropycorr: -0.04334808 hartree
gibbsenthalpy: -2689.82148793 hartree
gibbsminuselec: 0.08186816 hartree
