program: Orca
programVersion: 5.0.4
elementType: C N Se F N C H H H H H H H H
charge: 1
multiplicity: 1
keywords: SP DSD-BLYP D3BJ def2-QZVPP def2-QZVPP/C def2/J TightSCF
formula: C2H8FN2Se
InChI: InChI=1/C2H8FN2Se/c1-4-6(3)5-2/h4-5H,1-2H3
14 atoms
C  2.320884 -1.24759 0.129677
N  0.854382 -1.142723 0.067703
Se 0.128471 0.395572 -0.289675
F  0.010469 1.110452 1.28241
N  -1.517642 -0.06914 -0.591858
C  -2.307888 -0.970845 0.249483
H  2.72942 -0.907942 1.079772
H  2.573422 -2.294328 -0.017244
H  2.778321 -0.689091 -0.685299
H  0.352389 -1.771025 0.687976
H  -2.037156 0.64361 -1.093102
H  -1.892254 -1.976277 0.229326
H  -3.299472 -1.03121 -0.190151
H  -2.404128 -0.617123 1.275239
totalener: -2690.17511148 hartree
nucrepener: 529.49768600 hartree
electener: -3219.67279748 hartree
oneelecener: -4775.85021835 hartree
twoeener: 1556.17742087 hartree
kineticenergy: 2687.78367913 hartree
exchangeener: -37.833616118984 hartree
correlationener: -1.671429036350 hartree
xcener: -39.505045155334 hartree
chargesum: 1.0000000
charge: 0.001161 -0.400899 1.182901 -0.382119 -0.395877 -0.024013 0.107093 0.108804 0.075390 0.205256 0.209132 0.086947 0.107375 0.118849
charge: 0.142727 0.269542 0.975727 -0.073171 0.265357 0.148642 -0.060668 -0.047029 -0.058355 -0.198744 -0.198462 -0.062681 -0.042656 -0.060230
qa: 0.0012 -0.4009 1.1829 -0.3821 -0.3959 -0.0240 0.1071 0.1088 0.0754 0.2053 0.2091 0.0869 0.1074 0.1188
va: 3.8190 3.0876 3.5229 0.9237 3.0817 3.8199 0.9882 0.9875 0.9922 1.0190 1.0121 0.9904 0.9936 0.9840
total: -2690.983631416 hartree
dispersion: -0.008368989 hartree
energy: -2690.992000405222 hartree
dipole: -2.46029 2.13642 -0.32387 -13.21401 12.30042 -0.91359 2.99589 -3.41940 -0.42351
magnitude: 1.05778 au
magnitude: 2.68866 debye
