program: Orca
programVersion: 5.0.4
elementType: C N Se N C O H H H H H H H H
charge: 0
multiplicity: 1
keywords: Freq RIJCOSX PBEh-3c
frequency: 0.00 0.00 0.00 0.00 0.00 0.00 83.85 120.67 171.93 184.60 208.50 235.88 337.44 380.53 441.60 540.52 581.65 740.06 772.58 1003.45 1094.11 1107.67 1152.60 1171.04 1179.31 1180.05 1432.50 1458.34 1503.23 1508.80 1555.21 1560.71 1566.04 1568.44 3070.99 3110.55 3165.69 3188.94 3208.45 3227.21 3600.00 3607.67
frequency: 83.85 120.67 171.93 184.60 208.50 235.88 337.44 380.53 441.60 540.52 581.65 740.06 772.58 1003.45 1094.11 1107.67 1152.60 1171.04 1179.31 1180.05 1432.50 1458.34 1503.23 1508.80 1555.21 1560.71 1566.04 1568.44 3070.99 3110.55 3165.69 3188.94 3208.45 3227.21 3600.00 3607.67
formula: C2H8N2OSe
InChI: InChI=1/C2H8N2OSe/c1-3-6(5)4-2/h3-4H,1-2H3
14 atoms
C  1.793432 -0.243845 -0.758187
N  1.046724 0.972474 -0.466426
Se 0.258426 1.043527 1.182594
N  -1.030319 -0.178134 0.684525
C  -2.128059 0.32568 -0.119082
O  1.131692 0.175713 2.219512
H  2.664014 -0.39733 -0.116352
H  2.123771 -0.204031 -1.795569
H  1.134527 -1.102849 -0.651233
H  1.60613 1.805739 -0.613359
H  -1.339917 -0.674754 1.513148
H  -1.733211 0.774582 -1.029663
H  -2.752091 -0.514448 -0.424202
H  -2.775319 1.060776 0.374393
totalener: -2665.57822777 hartree
nucrepener: 514.75045707 hartree
electener: -3180.32868485 hartree
oneelecener: -4727.68347110 hartree
twoeener: 1547.35478626 hartree
kineticenergy: 2661.97584414 hartree
exchangeener: -67.744943324892 hartree
correlationener: -3.984736988424 hartree
xcener: -71.729680313316 hartree
energy: -12397.6031 -1600.6839 -1435.8583 -1435.8527 -1435.8007 -529.1476 -398.6499 -398.5390 -284.8103 -284.5282 -223.4949 -166.0163 -166.0033 -165.8339 -64.1606 -64.1368 -64.0023 -63.9580 -63.9155 -29.6216 -27.0937 -26.7025 -21.3171 -20.5096 -18.6979 -15.2461 -14.8436 -14.3284 -13.3441 -13.2133 -13.0066 -11.8440 -11.6338 -11.1110 -9.2198 -8.7570 -8.1639 -7.5004 0.9683 1.8043 3.0972 3.9496 4.4644 5.1225 5.4831 5.8460 6.0599 6.3040 6.3762 6.5350 6.8066 9.7549 12.1713 12.6767 13.5477 13.8945 14.2625 14.4642 15.0759 15.0981 16.2953 17.8932 19.4317 20.0575 20.8313 22.5055 23.8967 24.8134 25.2960 26.3114 26.8632 27.4398 27.6716 27.9475 28.5250 28.6689 28.7914 29.5300 30.1156 31.1069 31.5962 32.2110 33.6105 33.9382 35.2666 41.3468 41.6696 43.6595 44.5125 46.1438 46.8170 51.9471 52.1493 53.0339 53.8268 55.0082 55.3778 56.0408 57.2541 57.2845 57.8031 60.6521 61.4439 62.0822 64.9678 65.8843 66.0320 66.1889 66.8427 67.1520 68.6905 73.5275 74.6413 89.7331 90.0756 91.7982 94.2034 97.1125 373.6387 374.3384 521.4840 521.6857 696.7018 electronvolt
chargesum: -0.0000000
charge: -0.509811 -0.734290 1.091361 -0.722192 -0.508846 -0.698275 0.228146 0.222067 0.253176 0.348128 0.355747 0.242813 0.233281 0.198695
charge: -0.283446 -0.449497 0.811951 -0.445729 -0.286407 -0.578754 0.118161 0.125458 0.140505 0.237425 0.243754 0.134197 0.130856 0.101527
qa: -0.5098 -0.7343 1.0914 -0.7222 -0.5088 -0.6983 0.2281 0.2221 0.2532 0.3481 0.3557 0.2428 0.2333 0.1987
va: 3.7152 2.8060 3.5540 2.7949 3.7273 1.8518 0.9028 0.9111 0.9089 0.8389 0.8433 0.9084 0.9066 0.9062
dispersion: -0.006607789 hartree
energy: -2665.552829797336 hartree
dipole: -3.04954 2.38674 -0.66280 -8.28352 8.82708 0.54357 -12.59620 11.71520 -0.88100
magnitude: 1.22920 au
magnitude: 3.12437 debye
temp: 298.15 k
press: 1.00 atm
zeropoint: 0.11623399 hartree
thermalvibcorrection: 0.00543175 hartree
thermalrotcorrection: 0.00141627 hartree
thermaltrasncorrection: 0.00141627 hartree
thermaltotal: -2665.42833152 hartree
thermalcorr: 0.00826429 hartree
nonthermalcorr: 0.11623399 hartree
totalcorr: 0.12449828 hartree
thermalcorrenthalpy: 0.00094421 hartree
totalenthalpy: -2665.42738731 hartree
vibrat: 0.00947634 hartree
rotat: 0.01318188 hartree
transl: 0.01949247 hartree
total: 0.04215069 hartree
totalentropycorr: -0.04215069 hartree
gibbsenthalpy: -2665.46953800 hartree
gibbsminuselec: 0.08329180 hartree
