program: Orca
programVersion: 5.0.4
elementType: C N Se N C O H H H H H H H H
charge: 0
multiplicity: 1
keywords: SP DSD-BLYP D3BJ def2-QZVPP def2-QZVPP/C def2/J TightSCF
formula: C2H8N2OSe
InChI: InChI=1/C2H8N2OSe/c1-3-6(5)4-2/h3-4H,1-2H3
14 atoms
C  1.576469 -0.876324 -1.523335
N  0.829761 0.339994 -1.231574
Se 0.041463 0.411048 0.417446
N  -1.247282 -0.810614 -0.080623
C  -2.345022 -0.3068 -0.884231
O  0.914729 -0.456766 1.454364
H  2.447052 -1.029809 -0.8815
H  1.906808 -0.836511 -2.560717
H  0.917565 -1.735328 -1.416381
H  1.389167 1.17326 -1.378507
H  -1.55688 -1.307233 0.7480
H  -1.950173 0.142102 -1.794811
H  -2.969054 -1.146927 -1.18935
H  -2.992282 0.428297 -0.390755
totalener: -2665.78827044 hartree
nucrepener: 514.75045708 hartree
electener: -3180.53872751 hartree
oneelecener: -4727.78629847 hartree
twoeener: 1547.24757095 hartree
kineticenergy: 2663.45119931 hartree
exchangeener: -37.336930869110 hartree
correlationener: -1.660592891822 hartree
xcener: -38.997523760932 hartree
chargesum: 0.0000000
charge: -0.024313 -0.500268 1.005159 -0.493853 -0.036216 -0.706802 0.086046 0.063513 0.089138 0.142535 0.166846 0.084194 0.077958 0.046064
charge: 0.070586 0.225314 0.712729 0.245752 0.048648 -0.359595 -0.076245 -0.073319 -0.070561 -0.252968 -0.246180 -0.072749 -0.067892 -0.083519
qa: -0.0243 -0.5003 1.0052 -0.4939 -0.0362 -0.7068 0.0860 0.0635 0.0891 0.1425 0.1668 0.0842 0.0780 0.0461
va: 3.8567 2.8391 3.6307 2.8028 3.8907 1.7433 0.9899 0.9867 1.0031 1.0360 1.0405 0.9997 0.9937 0.9868
total: -2666.603736798 hartree
dispersion: -0.008939980 hartree
energy: -2666.612676778595 hartree
dipole: -3.04954 2.28717 -0.76237 -8.28352 8.85690 0.57338 -12.59620 11.56562 -1.03058
magnitude: 1.40430 au
magnitude: 3.56945 debye
