program: Orca
programVersion: 5.0.4
elementType: C N Se N C H H H H H H H H
charge: 2
multiplicity: 1
keywords: SP DSD-BLYP D3BJ def2-QZVPP def2-QZVPP/C def2/J TightSCF
formula: C2H8N2Se
InChI: InChI=1/C2H8N2Se/c1-3-5-4-2/h3-4H,1-2H3
13 atoms
C  -2.24461 -1.070217 -0.009156
N  -1.546724 0.209784 0.177318
Se 0.120154 0.55969 0.097852
N  0.867526 -0.922233 -0.271976
C  2.33576 -1.082116 -0.398347
H  -3.297728 -0.901972 0.203212
H  -1.865724 -1.821305 0.68801
H  -2.148452 -1.411864 -1.043414
H  -2.128507 1.034996 0.372142
H  0.31696 -1.776318 -0.415854
H  2.863568 -0.140621 -0.257686
H  2.540981 -1.476337 -1.39494
H  2.658476 -1.803748 0.354264
totalener: -2590.00751794 hartree
nucrepener: 385.20242269 hartree
electener: -2975.20994063 hartree
oneelecener: -4334.70621341 hartree
twoeener: 1359.49627279 hartree
kineticenergy: 2587.77409805 hartree
exchangeener: -34.583893041860 hartree
correlationener: -1.465666855144 hartree
xcener: -36.049559897004 hartree
chargesum: 2.0000000
charge: 0.024503 -0.257677 1.108834 -0.263813 0.026939 0.160539 0.105025 0.127710 0.280898 0.270519 0.098097 0.159373 0.159053
charge: 0.221006 0.322555 1.329433 0.332437 0.233147 -0.017611 -0.038839 -0.034810 -0.125040 -0.132819 -0.041723 -0.023662 -0.024074
qa: 0.0245 -0.2577 1.1088 -0.2638 0.0269 0.1605 0.1050 0.1277 0.2809 0.2705 0.0981 0.1594 0.1591
va: 3.7329 3.4008 3.2950 3.4272 3.7166 0.9838 0.9845 0.9866 0.9638 0.9659 0.9916 0.9781 0.9782
total: -2590.682525679 hartree
dispersion: -0.007395526 hartree
energy: -2590.689921205539 hartree
dipole: -2.23468 1.74278 -0.49190 -13.54590 12.52730 -1.01860 -2.40905 2.24079 -0.16826
magnitude: 1.14360 au
magnitude: 2.90681 debye
