program: Orca
programVersion: 5.0.4
elementType: C N Se N C C O H H H H H H H H H H
charge: 0
multiplicity: 1
keywords: Freq RIJCOSX PBEh-3c
frequency: 0.00 0.00 0.00 0.00 0.00 0.00 65.06 105.09 162.03 180.11 213.59 234.17 248.66 289.55 326.61 358.93 406.41 444.84 549.30 574.38 754.68 985.30 1000.43 1096.74 1108.45 1154.47 1158.45 1178.40 1204.99 1271.72 1308.56 1453.25 1495.61 1500.96 1520.72 1543.57 1554.43 1555.98 1558.58 1567.74 1572.30 3051.36 3053.86 3108.57 3144.88 3148.76 3185.90 3201.67 3226.12 3227.45 3599.68
frequency: 65.06 105.09 162.03 180.11 213.59 234.17 248.66 289.55 326.61 358.93 406.41 444.84 549.30 574.38 754.68 985.30 1000.43 1096.74 1108.45 1154.47 1158.45 1178.40 1204.99 1271.72 1308.56 1453.25 1495.61 1500.96 1520.72 1543.57 1554.43 1555.98 1558.58 1567.74 1572.30 3051.36 3053.86 3108.57 3144.88 3148.76 3185.90 3201.67 3226.12 3227.45 3599.68
formula: C3H10N2OSe
InChI: InChI=1/C3H10N2OSe/c1-4-7(6)5(2)3/h4H,1-3H3
17 atoms
C  2.062897 0.466209 1.124618
N  1.854918 -0.282734 -0.106557
Se 0.571745 0.348513 -1.250255
N  -0.776678 -0.130409 -0.06877
C  -1.06878 -1.54834 -0.067021
C  -1.958836 0.704424 -0.113819
O  0.539824 1.957969 -1.19022
H  1.124605 0.522063 1.672079
H  2.775204 -0.080795 1.741953
H  2.436479 1.481964 0.974645
H  2.720928 -0.42476 -0.615288
H  -1.640091 -1.789994 0.831589
H  -1.657158 -1.884484 -0.93185
H  -0.147475 -2.128636 -0.022697
H  -2.637036 0.474679 -0.947234
H  -1.682567 1.754696 -0.169527
H  -2.518079 0.559434 0.813253
totalener: -2704.80557194 hartree
nucrepener: 630.38868570 hartree
electener: -3335.19425765 hartree
oneelecener: -5010.62738802 hartree
twoeener: 1675.43313037 hartree
kineticenergy: 2700.83072760 hartree
exchangeener: -71.023120868520 hartree
correlationener: -4.326173687611 hartree
xcener: -75.349294556131 hartree
energy: -12397.6070 -1600.6772 -1435.8519 -1435.8453 -1435.7947 -529.2336 -398.6984 -398.6693 -284.7355 -284.5664 -284.5467 -223.4842 -166.0057 -165.9911 -165.8233 -64.1471 -64.1262 -63.9926 -63.9447 -63.9046 -29.6738 -27.4474 -26.9050 -21.7396 -21.3094 -19.9242 -17.8031 -15.2603 -14.9049 -14.1436 -14.0535 -13.4830 -12.9923 -12.2917 -11.8007 -11.6468 -11.4377 -11.0932 -9.2715 -8.6382 -8.0849 -7.2391 0.8959 1.8458 3.0089 3.7381 4.4209 5.2199 5.4098 5.4890 5.8988 6.1138 6.2495 6.2986 6.5121 6.8254 6.9675 7.4090 9.7002 11.7509 12.4743 13.2064 13.7086 13.8616 14.3366 14.8781 15.1689 15.8258 16.4455 17.3480 18.1551 18.9179 19.8155 20.9608 21.1834 23.0069 24.6196 25.0301 25.7493 26.1430 26.8828 27.4456 27.5675 27.9790 28.2263 28.3709 28.6480 29.0724 29.9091 30.1569 30.8435 31.1064 32.0894 33.1502 33.7627 34.2331 34.7262 38.0689 41.2046 41.3293 41.7765 44.0152 45.8971 46.5355 51.3303 51.7158 52.0615 52.7512 54.2578 54.8968 55.2731 55.9845 56.7855 57.2758 57.7662 58.5929 59.0378 60.6093 61.4564 61.9488 63.3184 63.9440 65.9289 66.1558 66.3342 68.7286 69.2291 70.0885 73.0968 73.8748 76.5956 89.8115 90.4153 92.4236 94.4475 97.1740 372.9957 374.3588 376.4308 521.6287 524.0410 696.8783 electronvolt
chargesum: -0.0000000
charge: -0.507945 -0.732876 1.101692 -0.556341 -0.502540 -0.510623 -0.696788 0.250099 0.222692 0.227411 0.348970 0.229571 0.196763 0.244286 0.190166 0.270319 0.225144
charge: -0.283578 -0.448452 0.824442 -0.323877 -0.276194 -0.277439 -0.573632 0.138583 0.125971 0.117695 0.237877 0.128208 0.102566 0.134302 0.100377 0.147155 0.125997
qa: -0.5079 -0.7329 1.1017 -0.5563 -0.5025 -0.5106 -0.6968 0.2501 0.2227 0.2274 0.3490 0.2296 0.1968 0.2443 0.1902 0.2703 0.2251
va: 3.7145 2.8077 3.5184 2.8940 3.6961 3.6916 1.8606 0.9107 0.9109 0.9026 0.8386 0.9075 0.9099 0.9147 0.9120 0.9118 0.9077
dispersion: -0.008810363 hartree
energy: -2704.777217311855 hartree
dipole: -6.72557 6.81605 0.09048 -4.73621 3.59840 -1.13780 15.43428 -15.20529 0.22899
magnitude: 1.16414 au
magnitude: 2.95901 debye
temp: 298.15 k
press: 1.00 atm
zeropoint: 0.14501062 hartree
thermalvibcorrection: 0.00674951 hartree
thermalrotcorrection: 0.00141627 hartree
thermaltrasncorrection: 0.00141627 hartree
thermaltotal: -2704.62262464 hartree
thermalcorr: 0.00958205 hartree
nonthermalcorr: 0.14501062 hartree
totalcorr: 0.15459267 hartree
thermalcorrenthalpy: 0.00094421 hartree
totalenthalpy: -2704.62168043 hartree
vibrat: 0.01168225 hartree
rotat: 0.01353386 hartree
transl: 0.01961512 hartree
total: 0.04483123 hartree
totalentropycorr: -0.04483123 hartree
gibbsenthalpy: -2704.66651166 hartree
gibbsminuselec: 0.11070565 hartree
