program: Orca
programVersion: 5.0.4
elementType: C N Se N C C O H H H H H H H H H H
charge: 0
multiplicity: 1
keywords: Opt RIJCOSX PBEh-3c
formula: C3H10N2OSe
InChI: InChI=1/C3H10N2OSe/c1-4-7(6)5(2)3/h4H,1-3H3
17 atoms
C  2.062897 0.466209 1.124618
N  1.854918 -0.282734 -0.106557
Se 0.571745 0.348513 -1.250255
N  -0.776678 -0.130409 -0.06877
C  -1.06878 -1.54834 -0.067021
C  -1.958836 0.704424 -0.113819
O  0.539824 1.957969 -1.19022
H  1.124605 0.522063 1.672079
H  2.775204 -0.080795 1.741953
H  2.436479 1.481964 0.974645
H  2.720928 -0.42476 -0.615288
H  -1.640091 -1.789994 0.831589
H  -1.657158 -1.884484 -0.93185
H  -0.147475 -2.128636 -0.022697
H  -2.637036 0.474679 -0.947234
H  -1.682567 1.754696 -0.169527
H  -2.518079 0.559434 0.813253
totalener: -2704.80559369 hartree
nucrepener: 630.40612146 hartree
electener: -3335.21171515 hartree
oneelecener: -5010.65961631 hartree
twoeener: 1675.44790116 hartree
kineticenergy: 2700.83163161 hartree
exchangeener: -71.023311144552 hartree
correlationener: -4.326203759796 hartree
xcener: -75.349514904348 hartree
dispersion: -0.008810801 hartree
dispersion: -0.008809035 hartree
energy: -12397.6070 -1600.6772 -1435.8520 -1435.8453 -1435.7948 -529.2336 -398.6987 -398.6691 -284.7355 -284.5664 -284.5468 -223.4843 -166.0057 -165.9911 -165.8234 -64.1471 -64.1262 -63.9926 -63.9448 -63.9047 -29.6738 -27.4475 -26.9049 -21.7396 -21.3094 -19.9242 -17.8031 -15.2603 -14.9049 -14.1437 -14.0535 -13.4830 -12.9923 -12.2918 -11.8008 -11.6468 -11.4378 -11.0932 -9.2715 -8.6382 -8.0848 -7.2392 0.8959 1.8458 3.0089 3.7380 4.4209 5.2199 5.4098 5.4890 5.8988 6.1138 6.2495 6.2986 6.5121 6.8254 6.9675 7.4090 9.7002 11.7509 12.4743 13.2064 13.7086 13.8616 14.3366 14.8781 15.1689 15.8257 16.4455 17.3479 18.1551 18.9179 19.8155 20.9608 21.1834 23.0069 24.6196 25.0301 25.7492 26.1430 26.8828 27.4456 27.5675 27.9790 28.2263 28.3709 28.6480 29.0724 29.9091 30.1569 30.8435 31.1064 32.0894 33.1503 33.7627 34.2331 34.7262 38.0689 41.2045 41.3292 41.7765 44.0152 45.8972 46.5355 51.3303 51.7158 52.0616 52.7512 54.2578 54.8968 55.2731 55.9845 56.7855 57.2758 57.7662 58.5928 59.0377 60.6094 61.4564 61.9487 63.3183 63.9439 65.9289 66.1558 66.3342 68.7287 69.2290 70.0884 73.0968 73.8748 76.5955 89.8115 90.4153 92.4236 94.4475 97.1740 372.9956 374.3588 376.4307 521.6289 524.0408 696.8784 electronvolt
chargesum: -0.0000000
charge: -0.507944 -0.732883 1.101692 -0.556332 -0.502541 -0.510620 -0.696789 0.250099 0.222693 0.227410 0.348972 0.229571 0.196763 0.244285 0.190165 0.270318 0.225143
charge: -0.283576 -0.448459 0.824442 -0.323870 -0.276195 -0.277437 -0.573634 0.138582 0.125971 0.117694 0.237878 0.128207 0.102566 0.134301 0.100377 0.147154 0.125996
qa: -0.5079 -0.7329 1.1017 -0.5563 -0.5025 -0.5106 -0.6968 0.2501 0.2227 0.2274 0.3490 0.2296 0.1968 0.2443 0.1902 0.2703 0.2251
va: 3.7145 2.8077 3.5184 2.8940 3.6961 3.6916 1.8606 0.9107 0.9109 0.9026 0.8386 0.9075 0.9099 0.9147 0.9120 0.9118 0.9077
dispersion: -0.008810363 hartree
energy: -2704.777217257635 hartree
dipole: -6.72557 6.81602 0.09045 -4.73621 3.59839 -1.13782 15.43428 -15.20529 0.22899
magnitude: 1.16415 au
magnitude: 2.95903 debye
