program: Orca
programVersion: 5.0.4
elementType: C N Se N C C O H H H H H H H H H H
charge: 0
multiplicity: 1
keywords: SP DSD-BLYP D3BJ def2-QZVPP def2-QZVPP/C def2/J TightSCF
formula: C3H10N2OSe
InChI: InChI=1/C3H10N2OSe/c1-4-7(6)5(2)3/h4H,1-3H3
17 atoms
C  1.731331 0.188278 1.748625
N  1.523352 -0.560665 0.51745
Se 0.240179 0.070582 -0.626248
N  -1.108244 -0.40834 0.555237
C  -1.400346 -1.826271 0.556986
C  -2.290402 0.426493 0.510187
O  0.208258 1.680038 -0.566213
H  0.793039 0.244132 2.296086
H  2.443638 -0.358726 2.365959
H  2.104913 1.204033 1.598652
H  2.389362 -0.702691 0.008719
H  -1.971657 -2.067925 1.455596
H  -1.988724 -2.162415 -0.307843
H  -0.479041 -2.406567 0.60131
H  -2.968602 0.196748 -0.323228
H  -2.014133 1.476765 0.45448
H  -2.849645 0.281503 1.43726
totalener: -2704.96413250 hartree
nucrepener: 630.38868553 hartree
electener: -3335.35281802 hartree
oneelecener: -5010.77395811 hartree
twoeener: 1675.42114009 hartree
kineticenergy: 2702.52063183 hartree
exchangeener: -39.167748170178 hartree
correlationener: -1.800951038588 hartree
xcener: -40.968699208766 hartree
chargesum: 0.0000000
charge: -0.029427 -0.508540 1.003782 -0.447088 -0.027318 -0.056299 -0.710867 0.081997 0.065629 0.088885 0.143475 0.071442 0.037003 0.078066 0.030602 0.119445 0.059212
charge: 0.072847 0.228532 0.740365 0.098793 0.043042 0.054086 -0.349205 -0.072097 -0.072386 -0.076204 -0.252747 -0.061331 -0.075171 -0.071909 -0.074370 -0.068309 -0.063937
qa: -0.0294 -0.5085 1.0038 -0.4471 -0.0273 -0.0563 -0.7109 0.0820 0.0656 0.0889 0.1435 0.0714 0.0370 0.0781 0.0306 0.1194 0.0592
va: 3.8659 2.8476 3.6157 2.7527 3.8938 3.8950 1.7413 1.0022 0.9872 0.9901 1.0386 0.9896 1.0024 1.0001 1.0021 1.0034 0.9840
total: -2705.873046326 hartree
dispersion: -0.011477814 hartree
energy: -2705.884524139449 hartree
dipole: -6.72557 6.76620 0.04063 -4.73621 3.44790 -1.28831 15.43428 -15.14440 0.28988
magnitude: 1.32115 au
magnitude: 3.35809 debye
