program: Orca
programVersion: 5.0.4
elementType: C N Se N C C H H H H H H H H H H
charge: 2
multiplicity: 1
keywords: SP DSD-BLYP D3BJ def2-QZVPP def2-QZVPP/C def2/J TightSCF
formula: C3H10N2Se
InChI: InChI=1/C3H10N2Se/c1-4-6-5(2)3/h4H,1-3H3
16 atoms
C  2.744969 0.759187 0.347847
N  1.265541 0.814372 0.413896
Se 0.269745 -0.40563 -0.247937
N  -1.340605 0.055869 0.086299
C  -1.724067 1.27491 0.807746
C  -2.418909 -0.84276 -0.391385
H  3.096394 -0.133297 -0.166801
H  3.127603 0.76487 1.368874
H  3.092015 1.646479 -0.182076
H  0.870354 1.633038 0.884192
H  -1.417842 2.166215 0.252421
H  -1.299445 1.280708 1.815531
H  -2.808067 1.287747 0.897346
H  -2.036464 -1.720104 -0.913887
H  -2.995126 -1.165663 0.477381
H  -3.05884 -0.273002 -1.067318
totalener: -2629.20695094 hartree
nucrepener: 488.97304360 hartree
electener: -3118.17999454 hartree
oneelecener: -4592.45695043 hartree
twoeener: 1474.27695588 hartree
kineticenergy: 2626.87071906 hartree
exchangeener: -36.414409496972 hartree
correlationener: -1.605340079639 hartree
xcener: -38.019749576610 hartree
chargesum: 2.0000000
charge: 0.020827 -0.292312 1.039731 -0.220874 0.009453 0.004904 0.090293 0.154532 0.152693 0.260579 0.116329 0.108942 0.158279 0.100306 0.148181 0.148139
charge: 0.221044 0.319412 1.300622 0.156501 0.210709 0.212043 -0.044654 -0.028524 -0.028561 -0.147471 -0.033636 -0.035208 -0.016834 -0.041410 -0.022051 -0.021982
qa: 0.0208 -0.2923 1.0397 -0.2209 0.0095 0.0049 0.0903 0.1545 0.1527 0.2606 0.1163 0.1089 0.1583 0.1003 0.1482 0.1481
va: 3.7321 3.3860 3.3169 3.4035 3.7347 3.7522 0.9933 0.9785 0.9796 0.9737 0.9892 0.9878 0.9869 0.9904 0.9746 0.9755
total: -2629.976860652 hartree
dispersion: -0.009723645 hartree
energy: -2629.986584297844 hartree
dipole: -5.99279 5.63415 -0.35863 9.32543 -8.45696 0.86847 5.71097 -5.19493 0.51604
magnitude: 1.07199 au
magnitude: 2.72478 debye
