program: Orca
programVersion: 5.0.4
elementType: C N C Se F F N C C H H H H H H H H H H H H
charge: 0
multiplicity: 1
keywords: SP DSD-BLYP D3BJ def2-QZVPP def2-QZVPP/C def2/J TightSCF
formula: C4H12F2N2Se
InChI: InChI=1/C4H12F2N2Se/c1-7(2)9(5,6)8(3)4/h1-4H3
21 atoms
C  1.763479 0.481857 -1.563445
N  1.321054 -0.44974 -0.543079
C  2.417728 -1.128695 0.12686
Se -0.013587 0.097078 0.572836
F  -0.375197 -1.675324 0.852371
F  0.350203 1.864414 0.266353
N  -1.293552 0.234392 -0.717692
C  -1.694526 -0.984492 -1.394608
C  -2.411065 1.092226 -0.361761
H  0.916263 0.939519 -2.066369
H  2.422262 1.271456 -1.190311
H  2.314327 -0.100752 -2.304153
H  2.977662 -1.688584 -0.623664
H  3.118486 -0.446501 0.623023
H  2.048329 -1.849452 0.852033
H  -0.829041 -1.580799 -1.670385
H  -2.197283 -0.683528 -2.315485
H  -2.382708 -1.608773 -0.817328
H  -3.142338 0.609829 0.297606
H  -2.92771 1.372258 -1.281038
H  -2.066027 2.01289 0.102358
totalener: -2868.45491349 hartree
nucrepener: 940.50750307 hartree
electener: -3808.96241656 hartree
oneelecener: -5857.56167879 hartree
twoeener: 2048.59926222 hartree
kineticenergy: 2865.74461764 hartree
exchangeener: -44.718340685993 hartree
correlationener: -2.157065180553 hartree
xcener: -46.875405866546 hartree
chargesum: -0.0000000
charge: -0.017694 -0.404950 -0.060380 1.227054 -0.559192 -0.559254 -0.405335 -0.020762 -0.059581 0.088913 0.066007 0.060318 0.065173 0.049677 0.099118 0.089870 0.062771 0.065314 0.049391 0.066251 0.097289
charge: 0.069089 0.117743 0.066473 0.755468 -0.232255 -0.231959 0.117635 0.069203 0.066563 -0.067018 -0.069370 -0.062416 -0.059668 -0.071333 -0.069221 -0.066777 -0.062572 -0.069365 -0.071500 -0.059624 -0.069094
qa: -0.0177 -0.4049 -0.0604 1.2271 -0.5592 -0.5593 -0.4053 -0.0208 -0.0596 0.0889 0.0660 0.0603 0.0652 0.0497 0.0991 0.0899 0.0628 0.0653 0.0494 0.0663 0.0973
va: 3.8408 2.8015 3.9030 3.4408 0.6551 0.6551 2.8011 3.8416 3.9041 1.0109 1.0070 0.9789 0.9848 1.0011 1.0000 1.0096 0.9786 1.0070 1.0019 0.9840 1.0001
total: -2869.605650822 hartree
dispersion: -0.014682716 hartree
energy: -2869.620333538770 hartree
dipole: 0.39971 -0.38565 0.01406 -2.81916 2.72360 -0.09556 -16.68760 16.10934 -0.57826
magnitude: 0.58627 au
magnitude: 1.49019 debye
