program: Orca
programVersion: 5.0.4
elementType: C N C Se N C C O H H H H H H H H H H H H
charge: 0
multiplicity: 1
keywords: Freq RIJCOSX PBEh-3c
frequency: 0.00 0.00 0.00 0.00 0.00 0.00 51.95 82.82 120.42 169.61 205.82 229.48 230.61 243.43 256.53 310.32 326.06 344.78 378.34 399.82 438.21 561.22 581.19 977.32 987.66 1002.09 1109.02 1109.43 1154.59 1158.23 1203.12 1203.89 1263.67 1277.46 1308.66 1313.55 1493.43 1495.68 1519.06 1522.97 1537.63 1543.21 1553.41 1555.29 1556.44 1558.07 1572.60 1576.44 3053.09 3056.54 3072.01 3086.54 3144.52 3148.24 3150.36 3158.93 3184.38 3197.52 3221.71 3227.73
frequency: 51.95 82.82 120.42 169.61 205.82 229.48 230.61 243.43 256.53 310.32 326.06 344.78 378.34 399.82 438.21 561.22 581.19 977.32 987.66 1002.09 1109.02 1109.43 1154.59 1158.23 1203.12 1203.89 1263.67 1277.46 1308.66 1313.55 1493.43 1495.68 1519.06 1522.97 1537.63 1543.21 1553.41 1555.29 1556.44 1558.07 1572.60 1576.44 3053.09 3056.54 3072.01 3086.54 3144.52 3148.24 3150.36 3158.93 3184.38 3197.52 3221.71 3227.73
formula: C4H12N2OSe
InChI: InChI=1/C4H12N2OSe/c1-5(2)8(7)6(3)4/h1-4H3
20 atoms
C  -1.968289 -0.152749 0.915407
N  -1.246189 0.305574 -0.251838
C  -2.082216 0.941234 -1.247661
Se -0.016987 -0.925675 -0.8962
N  1.210951 -0.471585 0.387997
C  1.713688 0.887987 0.352575
C  2.251111 -1.46481 0.576459
O  0.412194 -0.29941 -2.317545
H  -2.433678 0.705729 1.403909
H  -1.283959 -0.596261 1.638888
H  -2.764042 -0.877128 0.693655
H  -2.481358 1.865257 -0.823084
H  -2.935427 0.328812 -1.569165
H  -1.496763 1.207736 -2.124383
H  0.891958 1.588386 0.219023
H  2.183991 1.109097 1.313114
H  2.453372 1.055799 -0.43723
H  3.0438 -1.424715 -0.180035
H  1.832308 -2.472781 0.578412
H  2.715534 -1.310697 1.552503
totalener: -2744.03084647 hartree
nucrepener: 749.93777556 hartree
electener: -3493.96862203 hartree
oneelecener: -5301.33954429 hartree
twoeener: 1807.37092226 hartree
kineticenergy: 2739.69848642 hartree
exchangeener: -74.303731244549 hartree
correlationener: -4.667099798852 hartree
xcener: -78.970831043401 hartree
energy: -12397.5855 -1600.6467 -1435.8225 -1435.8145 -1435.7640 -529.2303 -398.7792 -398.7103 -284.8701 -284.7783 -284.5521 -284.5070 -223.4513 -165.9712 -165.9593 -165.7892 -64.1150 -64.0929 -63.9574 -63.9115 -63.8717 -29.6923 -27.5515 -27.3766 -21.7858 -21.7579 -21.2867 -19.0697 -17.4715 -15.2766 -14.7325 -14.3374 -14.0339 -13.8244 -13.7450 -12.3597 -12.3277 -11.8870 -11.7020 -11.6085 -11.3703 -11.0725 -9.1467 -8.5579 -7.7052 -7.2259 0.9210 1.7746 3.0417 3.6083 4.4334 4.9809 5.2242 5.3967 5.6099 5.8152 5.9256 6.0200 6.3275 6.4807 6.5969 6.7993 6.9550 7.2707 7.5351 9.7342 11.4732 12.3701 12.9621 13.2046 13.7705 13.9534 14.8528 15.1294 15.2650 15.6886 16.4705 17.3482 18.0756 18.1503 18.7603 19.3890 20.7224 21.0289 22.2304 22.8737 25.3317 25.5903 25.7107 26.6285 26.9248 27.3000 27.6179 27.7337 28.0760 28.2963 28.7365 28.8437 29.0057 29.7616 30.0927 30.5942 31.0467 31.2310 31.4141 33.1358 33.8362 33.9599 34.5642 37.8874 39.0091 40.8065 41.2256 41.4245 41.8074 45.6304 46.2170 50.6365 51.3027 51.8857 52.2339 52.8131 54.2766 54.9594 55.6201 56.0574 56.5885 56.8840 57.0420 57.6741 58.5732 58.6507 59.2995 60.4472 61.5993 61.9570 63.0364 63.3814 63.7748 64.5885 68.4788 68.9758 69.3124 69.8334 70.4006 72.7889 73.2612 75.6857 76.8615 90.1956 90.7594 92.7185 94.7894 97.3940 372.8801 373.2843 376.2676 376.5559 523.7386 524.3571 697.0395 electronvolt
chargesum: -0.0000000
charge: -0.499412 -0.560813 -0.507850 1.108202 -0.562909 -0.503372 -0.496947 -0.693156 0.229894 0.239966 0.198542 0.223432 0.191898 0.270558 0.254230 0.218843 0.218581 0.214422 0.225610 0.230280
charge: -0.275106 -0.324883 -0.276526 0.838752 -0.326233 -0.273281 -0.272091 -0.571727 0.128199 0.132447 0.103564 0.124979 0.101437 0.147600 0.139548 0.123722 0.115173 0.111416 0.125997 0.127011
qa: -0.4994 -0.5608 -0.5078 1.1082 -0.5629 -0.5034 -0.4969 -0.6932 0.2299 0.2400 0.1985 0.2234 0.1919 0.2706 0.2542 0.2188 0.2186 0.2144 0.2256 0.2303
va: 3.6991 2.8974 3.6917 3.5072 2.9046 3.6939 3.7022 1.8675 0.9073 0.9155 0.9093 0.9077 0.9118 0.9121 0.9152 0.9107 0.9058 0.9033 0.9154 0.9063
dispersion: -0.010909642 hartree
energy: -2744.000296795022 hartree
dipole: -0.09545 -0.17531 -0.27076 11.03996 -11.23674 -0.19678 11.83664 -10.63164 1.20500
magnitude: 1.25062 au
magnitude: 3.17882 debye
temp: 298.15 k
press: 1.00 atm
zeropoint: 0.17356242 hartree
thermalvibcorrection: 0.00822456 hartree
thermalrotcorrection: 0.00141627 hartree
thermaltrasncorrection: 0.00141627 hartree
thermaltotal: -2743.81567728 hartree
thermalcorr: 0.01105710 hartree
nonthermalcorr: 0.17356242 hartree
totalcorr: 0.18461952 hartree
thermalcorrenthalpy: 0.00094421 hartree
totalenthalpy: -2743.81473307 hartree
vibrat: 0.01430819 hartree
rotat: 0.01385148 hartree
transl: 0.01972799 hartree
total: 0.04788767 hartree
totalentropycorr: -0.04788767 hartree
gibbsenthalpy: -2743.86262074 hartree
gibbsminuselec: 0.13767606 hartree
