program: Orca
programVersion: 5.0.4
elementType: C N C Se N C C O H H H H H H H H H H H H
charge: 0
multiplicity: 1
keywords: Opt RIJCOSX PBEh-3c
formula: C4H12N2OSe
InChI: InChI=1/C4H12N2OSe/c1-5(2)8(7)6(3)4/h1-4H3
20 atoms
C  -1.968289 -0.152749 0.915407
N  -1.246189 0.305574 -0.251838
C  -2.082216 0.941234 -1.247661
Se -0.016987 -0.925675 -0.8962
N  1.210951 -0.471585 0.387997
C  1.713688 0.887987 0.352575
C  2.251111 -1.46481 0.576459
O  0.412194 -0.29941 -2.317545
H  -2.433678 0.705729 1.403909
H  -1.283959 -0.596261 1.638888
H  -2.764042 -0.877128 0.693655
H  -2.481358 1.865257 -0.823084
H  -2.935427 0.328812 -1.569165
H  -1.496763 1.207736 -2.124383
H  0.891958 1.588386 0.219023
H  2.183991 1.109097 1.313114
H  2.453372 1.055799 -0.43723
H  3.0438 -1.424715 -0.180035
H  1.832308 -2.472781 0.578412
H  2.715534 -1.310697 1.552503
totalener: -2744.03086073 hartree
nucrepener: 750.02399451 hartree
electener: -3494.05485524 hartree
oneelecener: -5301.51204198 hartree
twoeener: 1807.45718674 hartree
kineticenergy: 2739.69955435 hartree
exchangeener: -74.303870978060 hartree
correlationener: -4.667121478067 hartree
xcener: -78.970992456128 hartree
dispersion: -0.010911629 hartree
dispersion: -0.010911927 hartree
dispersion: -0.010909035 hartree
dispersion: -0.010911238 hartree
dispersion: -0.010909373 hartree
energy: -12397.5844 -1600.6456 -1435.8214 -1435.8134 -1435.7629 -529.2305 -398.7795 -398.7112 -284.8701 -284.7785 -284.5522 -284.5070 -223.4508 -165.9707 -165.9587 -165.7886 -64.1145 -64.0924 -63.9569 -63.9110 -63.8711 -29.6924 -27.5516 -27.3769 -21.7858 -21.7579 -21.2868 -19.0697 -17.4716 -15.2767 -14.7326 -14.3375 -14.0341 -13.8244 -13.7451 -12.3597 -12.3277 -11.8870 -11.7021 -11.6086 -11.3704 -11.0725 -9.1468 -8.5580 -7.7054 -7.2261 0.9210 1.7746 3.0416 3.6083 4.4334 4.9809 5.2242 5.3967 5.6099 5.8152 5.9256 6.0200 6.3275 6.4806 6.5969 6.7993 6.9549 7.2706 7.5351 9.7342 11.4732 12.3701 12.9620 13.2045 13.7705 13.9534 14.8527 15.1294 15.2650 15.6885 16.4704 17.3481 18.0756 18.1503 18.7602 19.3890 20.7224 21.0289 22.2303 22.8737 25.3316 25.5902 25.7106 26.6284 26.9247 27.2999 27.6179 27.7337 28.0760 28.2963 28.7364 28.8437 29.0056 29.7615 30.0927 30.5941 31.0466 31.2309 31.4141 33.1358 33.8361 33.9599 34.5641 37.8874 39.0091 40.8064 41.2255 41.4243 41.8073 45.6303 46.2168 50.6364 51.3026 51.8856 52.2338 52.8131 54.2765 54.9594 55.6200 56.0573 56.5884 56.8839 57.0420 57.6739 58.5731 58.6506 59.2994 60.4471 61.5992 61.9569 63.0363 63.3813 63.7746 64.5883 68.4788 68.9757 69.3122 69.8333 70.4006 72.7888 73.2609 75.6855 76.8613 90.1958 90.7596 92.7187 94.7897 97.3942 372.8801 373.2842 376.2675 376.5559 523.7380 524.3566 697.0393 electronvolt
chargesum: 0.0000000
charge: -0.499414 -0.560777 -0.507855 1.108173 -0.562893 -0.503374 -0.496949 -0.693149 0.229891 0.239965 0.198539 0.223430 0.191895 0.270558 0.254230 0.218841 0.218579 0.214421 0.225611 0.230278
charge: -0.275107 -0.324855 -0.276529 0.838728 -0.326221 -0.273282 -0.272092 -0.571722 0.128197 0.132446 0.103562 0.124978 0.101435 0.147600 0.139548 0.123721 0.115172 0.111415 0.125997 0.127009
qa: -0.4994 -0.5608 -0.5079 1.1082 -0.5629 -0.5034 -0.4969 -0.6931 0.2299 0.2400 0.1985 0.2234 0.1919 0.2706 0.2542 0.2188 0.2186 0.2144 0.2256 0.2303
va: 3.6991 2.8974 3.6917 3.5072 2.9046 3.6939 3.7022 1.8675 0.9073 0.9155 0.9093 0.9077 0.9118 0.9121 0.9152 0.9107 0.9058 0.9033 0.9154 0.9063
dispersion: -0.010909642 hartree
energy: -2744.000296810670 hartree
dipole: -0.09545 -0.17531 -0.27076 11.03996 -11.23670 -0.19674 11.83664 -10.63162 1.20501
magnitude: 1.25063 au
magnitude: 3.17885 debye
