program: Orca
programVersion: 5.0.4
elementType: C N C Se N C C O H H H H H H H H H H H H
charge: 0
multiplicity: 1
keywords: SP DSD-BLYP D3BJ def2-QZVPP def2-QZVPP/C def2/J TightSCF
formula: C4H12N2OSe
InChI: InChI=1/C4H12N2OSe/c1-5(2)8(7)6(3)4/h1-4H3
20 atoms
C  -1.987153 0.2649 1.442327
N  -1.265053 0.723223 0.275082
C  -2.10108 1.358883 -0.720741
Se -0.035851 -0.508026 -0.36928
N  1.192087 -0.053935 0.914917
C  1.694824 1.305636 0.879495
C  2.232247 -1.047161 1.103379
O  0.39333 0.11824 -1.790625
H  -2.452542 1.123379 1.930828
H  -1.302822 -0.178611 2.165808
H  -2.782906 -0.459478 1.220575
H  -2.500222 2.282907 -0.296164
H  -2.954291 0.746462 -1.042245
H  -1.515626 1.625385 -1.597464
H  0.873094 2.006036 0.745943
H  2.165127 1.526746 1.840034
H  2.434508 1.473448 0.08969
H  3.024936 -1.007065 0.346885
H  1.813445 -2.055131 1.105331
H  2.696671 -0.893047 2.079423
totalener: -2744.13998456 hartree
nucrepener: 749.93777488 hartree
electener: -3494.07775943 hartree
oneelecener: -5301.51114005 hartree
twoeener: 1807.43338061 hartree
kineticenergy: 2741.58850144 hartree
exchangeener: -40.999111314296 hartree
correlationener: -1.940891170282 hartree
xcener: -42.940002484579 hartree
chargesum: 0.0000000
charge: -0.033761 -0.449389 -0.058038 0.995196 -0.462517 -0.027733 -0.038831 -0.717287 0.071063 0.071625 0.041861 0.059327 0.031775 0.117661 0.083982 0.060573 0.067430 0.058888 0.060156 0.068020
charge: 0.043562 0.101439 0.055377 0.769382 0.085481 0.068980 0.044546 -0.346408 -0.061187 -0.071239 -0.074510 -0.064489 -0.073656 -0.067917 -0.070347 -0.065244 -0.068972 -0.068868 -0.073276 -0.062653
qa: -0.0338 -0.4494 -0.0580 0.9952 -0.4625 -0.0277 -0.0388 -0.7173 0.0711 0.0716 0.0419 0.0593 0.0318 0.1177 0.0840 0.0606 0.0674 0.0589 0.0602 0.0680
va: 3.8998 2.7577 3.8991 3.6191 2.7823 3.8831 3.9133 1.7435 0.9893 1.0031 1.0038 0.9833 1.0017 1.0033 1.0037 0.9787 1.0014 1.0008 0.9970 0.9805
total: -2745.141549467 hartree
dispersion: -0.013897448 hartree
energy: -2745.155446914777 hartree
dipole: -0.09545 -0.21810 -0.31356 11.03996 -11.24231 -0.20236 11.83664 -10.47612 1.36051
magnitude: 1.41077 au
magnitude: 3.58588 debye
