program: Orca
programVersion: 5.0.4
elementType: N C C C C Se F F N C C C C H H H H H H H H H H H H H H H H H H H H
charge: 0
multiplicity: 1
keywords: Freq RIJCOSX PBEh-3c
frequency: 0.00 0.00 0.00 0.00 0.00 0.00 28.99 35.24 64.03 70.67 128.96 201.92 209.58 234.92 243.48 253.01 254.57 265.96 282.29 306.05 309.52 316.97 322.12 327.49 331.67 380.86 384.77 402.51 414.86 470.22 494.58 500.40 515.27 549.72 578.23 643.71 686.34 792.14 808.78 873.50 883.30 958.25 959.19 967.72 971.14 986.70 999.99 1000.89 1006.01 1088.79 1090.68 1095.71 1096.28 1272.54 1273.54 1299.02 1299.62 1301.50 1317.73 1457.47 1458.06 1459.56 1462.08 1473.78 1474.48 1494.37 1495.57 1528.18 1529.38 1533.73 1534.07 1536.42 1536.68 1561.78 1562.06 1566.55 1567.29 1569.63 1570.38 3110.87 3111.64 3113.96 3114.81 3127.62 3129.47 3191.54 3192.47 3192.88 3193.51 3201.85 3203.21 3203.65 3206.24 3215.73 3216.23 3230.47 3231.09 3560.24 3563.42
frequency: 28.99 35.24 64.03 70.67 128.96 201.92 209.58 234.92 243.48 253.01 254.57 265.96 282.29 306.05 309.52 316.97 322.12 327.49 331.67 380.86 384.77 402.51 414.86 470.22 494.58 500.40 515.27 549.72 578.23 643.71 686.34 792.14 808.78 873.50 883.30 958.25 959.19 967.72 971.14 986.70 999.99 1000.89 1006.01 1088.79 1090.68 1095.71 1096.28 1272.54 1273.54 1299.02 1299.62 1301.50 1317.73 1457.47 1458.06 1459.56 1462.08 1473.78 1474.48 1494.37 1495.57 1528.18 1529.38 1533.73 1534.07 1536.42 1536.68 1561.78 1562.06 1566.55 1567.29 1569.63 1570.38 3110.87 3111.64 3113.96 3114.81 3127.62 3129.47 3191.54 3192.47 3192.88 3193.51 3201.85 3203.21 3203.65 3206.24 3215.73 3216.23 3230.47 3231.09 3560.24 3563.42
formula: C8H20F2N2Se
InChI: InChI=1/C8H20F2N2Se/c1-7(2,3)11-13(9,10)12-8(4,5)6/h11-12H,1-6H3
33 atoms
N  -1.351953 0.140873 0.417248
C  -2.735359 -0.084569 -0.050727
C  -3.01246 -1.546123 -0.415725
C  -3.610415 0.313611 1.139313
C  -3.057779 0.821947 -1.234817
Se 0.037874 -0.249704 -0.6909
F  0.184917 -1.90722 0.083828
F  -0.110786 1.440702 -1.386952
N  1.287559 0.348952 0.490875
C  2.72265 0.147899 0.198697
C  3.080812 -1.335456 0.202133
C  3.445234 0.831823 1.361131
C  3.156914 0.790125 -1.12184
H  -1.186098 -0.41183 1.256069
H  -2.764043 -2.218799 0.406266
H  -2.44004 -1.867727 -1.287647
H  -4.067639 -1.685369 -0.655049
H  -3.411655 -0.31653 2.009301
H  -4.665629 0.200243 0.889684
H  -3.434331 1.350894 1.423026
H  -2.815372 1.859831 -1.014878
H  -4.122381 0.754319 -1.460938
H  -2.520674 0.538277 -2.140212
H  1.102829 1.344922 0.591292
H  4.165049 -1.439996 0.14909
H  2.730644 -1.822233 1.110358
H  2.664549 -1.874686 -0.648129
H  3.152005 0.389743 2.313064
H  3.224988 1.901291 1.399731
H  4.524694 0.724842 1.252063
H  2.889157 1.846828 -1.162579
H  4.237776 0.71285 -1.246792
H  2.698961 0.300368 -1.983382
totalener: -3025.25574784 hartree
nucrepener: 1445.03602178 hartree
electener: -4470.29176962 hartree
oneelecener: -7074.12345813 hartree
twoeener: 2603.83168851 hartree
kineticenergy: 3018.81326159 hartree
exchangeener: -94.128358362196 hartree
correlationener: -6.529494087832 hartree
xcener: -100.657852450028 hartree
energy: -12398.5500 -1601.4873 -1436.7009 -1436.6225 -1436.6004 -680.7939 -680.7883 -398.8152 -398.7846 -285.6146 -285.6009 -283.9096 -283.8913 -283.7909 -283.7580 -283.6482 -283.6190 -224.2200 -166.7722 -166.6649 -166.5384 -64.9065 -64.8174 -64.7049 -64.6469 -64.5937 -33.6065 -33.2809 -28.2206 -27.4063 -24.4106 -23.4441 -21.3407 -21.1953 -21.0723 -21.0540 -20.4081 -17.3594 -17.1681 -15.7959 -14.9432 -14.7119 -14.3509 -14.3234 -13.8657 -13.7631 -13.2284 -13.2057 -12.5810 -12.4104 -12.2342 -12.0355 -11.8659 -11.7558 -11.5575 -11.5134 -11.3957 -11.3607 -11.1545 -10.9920 -10.8379 -10.7193 -10.4849 -10.1847 -9.3951 -8.5970 -8.0153 0.2998 2.3320 2.6275 3.1856 3.7017 4.5247 4.5703 4.7314 4.8671 5.2391 5.3347 5.5066 5.5391 5.8199 5.9950 6.0400 6.1515 6.2364 6.2726 6.4893 6.6128 6.9054 6.9424 7.0387 7.0791 7.0909 7.2206 7.4357 7.5850 7.7106 8.1493 11.2259 11.9428 12.5733 12.8384 13.0318 13.6753 13.9591 14.0296 14.4509 14.6484 15.0747 15.2471 15.6629 15.9103 16.3711 16.6562 16.7116 17.0512 17.1449 17.8938 17.9869 18.6780 19.0597 19.3255 20.0451 20.6361 21.1597 21.7080 21.9416 22.3749 22.4158 23.5643 24.1529 24.8639 26.6551 26.8463 27.1888 27.2201 27.6106 27.6535 27.7397 27.8674 27.9480 28.0701 28.1557 28.4148 28.5045 28.6636 28.8440 28.9349 29.4219 29.5503 29.7056 29.7903 29.8400 30.0827 30.3104 30.5451 31.6879 31.7497 34.3866 35.2310 35.8393 35.9047 35.9688 36.1970 36.5237 36.7895 36.9986 37.1625 37.3394 37.6884 38.3852 39.0484 39.5641 40.1712 40.6052 41.0578 41.4807 42.7126 43.4366 43.6673 44.3772 45.5107 45.8280 47.0748 47.4537 48.4770 48.6390 48.6875 49.0174 49.5278 49.5784 50.4013 51.0419 51.8676 52.0527 52.1972 52.3564 52.6960 52.9631 56.8198 57.4952 57.7576 57.8082 58.2199 58.4293 59.6924 59.9288 60.7812 61.7454 62.1745 62.3512 62.9263 63.1953 63.3725 63.4136 63.5290 63.6371 63.6633 64.2228 64.3919 64.7362 66.0578 66.5860 70.4182 72.5245 72.5790 73.3206 73.7620 74.6560 74.7572 75.0530 75.2432 77.5603 77.7402 81.8894 92.4447 93.5859 95.3517 97.2190 100.9020 369.5769 369.6880 377.4837 377.5506 377.9456 377.9806 384.0288 384.1085 523.0724 526.3255 887.6614 897.0593 electronvolt
chargesum: -0.0000000
charge: -0.706301 0.024412 -0.614640 -0.621384 -0.614940 1.335415 -0.515232 -0.516103 -0.708670 0.026525 -0.611896 -0.623115 -0.617803 0.363544 0.227052 0.222253 0.213822 0.213197 0.219796 0.240830 0.247000 0.209812 0.223785 0.364370 0.207111 0.244093 0.227008 0.240663 0.213578 0.220609 0.228131 0.215892 0.221186
charge: -0.381099 -0.048621 -0.361092 -0.345653 -0.350657 0.985267 -0.442516 -0.442477 -0.381783 -0.048077 -0.350462 -0.345871 -0.361507 0.251678 0.132635 0.128930 0.129170 0.125051 0.131813 0.137869 0.142515 0.127324 0.130104 0.252046 0.126056 0.141484 0.131484 0.137901 0.124905 0.132185 0.132825 0.130181 0.128390
qa: -0.7063 0.0244 -0.6146 -0.6214 -0.6149 1.3354 -0.5152 -0.5161 -0.7087 0.0265 -0.6119 -0.6231 -0.6178 0.3635 0.2271 0.2223 0.2138 0.2132 0.2198 0.2408 0.2470 0.2098 0.2238 0.3644 0.2071 0.2441 0.2270 0.2407 0.2136 0.2206 0.2281 0.2159 0.2212
va: 2.7779 3.8559 3.6788 3.6826 3.6896 3.4768 0.8257 0.8241 2.7785 3.8539 3.6916 3.6827 3.6758 0.8490 0.9164 0.9171 0.9144 0.9187 0.9163 0.9093 0.9104 0.9143 0.9186 0.8485 0.9144 0.9117 0.9193 0.9093 0.9186 0.9163 0.9157 0.9144 0.9168
dispersion: -0.020641107 hartree
energy: -3025.204837906746 hartree
dipole: -0.57826 0.58164 0.00338 3.83597 -3.71963 0.11634 11.08267 -10.76491 0.31776
magnitude: 0.33841 au
magnitude: 0.86016 debye
temp: 298.15 k
press: 1.00 atm
zeropoint: 0.29213936 hartree
thermalvibcorrection: 0.01402511 hartree
thermalrotcorrection: 0.00141627 hartree
thermaltrasncorrection: 0.00141627 hartree
thermaltotal: -3024.89584089 hartree
thermalcorr: 0.01685766 hartree
nonthermalcorr: 0.29213936 hartree
totalcorr: 0.30899702 hartree
thermalcorrenthalpy: 0.00094421 hartree
totalenthalpy: -3024.89489668 hartree
vibrat: 0.02401086 hartree
rotat: 0.01517680 hartree
transl: 0.02023112 hartree
total: 0.05941879 hartree
totalentropycorr: -0.05941879 hartree
gibbsenthalpy: -3024.95431547 hartree
gibbsminuselec: 0.25052244 hartree
