program: Orca
programVersion: 5.0.4
elementType: N C C C C Se F F N C C C C H H H H H H H H H H H H H H H H H H H H
charge: 0
multiplicity: 1
keywords: Opt RIJCOSX PBEh-3c
formula: C8H20F2N2Se
InChI: InChI=1/C8H20F2N2Se/c1-7(2,3)11-13(9,10)12-8(4,5)6/h11-12H,1-6H3
33 atoms
N  -1.351953 0.140873 0.417248
C  -2.735359 -0.084569 -0.050727
C  -3.01246 -1.546123 -0.415725
C  -3.610415 0.313611 1.139313
C  -3.057779 0.821947 -1.234817
Se 0.037874 -0.249704 -0.6909
F  0.184917 -1.90722 0.083828
F  -0.110786 1.440702 -1.386952
N  1.287559 0.348952 0.490875
C  2.72265 0.147899 0.198697
C  3.080812 -1.335456 0.202133
C  3.445234 0.831823 1.361131
C  3.156914 0.790125 -1.12184
H  -1.186098 -0.41183 1.256069
H  -2.764043 -2.218799 0.406266
H  -2.44004 -1.867727 -1.287647
H  -4.067639 -1.685369 -0.655049
H  -3.411655 -0.31653 2.009301
H  -4.665629 0.200243 0.889684
H  -3.434331 1.350894 1.423026
H  -2.815372 1.859831 -1.014878
H  -4.122381 0.754319 -1.460938
H  -2.520674 0.538277 -2.140212
H  1.102829 1.344922 0.591292
H  4.165049 -1.439996 0.14909
H  2.730644 -1.822233 1.110358
H  2.664549 -1.874686 -0.648129
H  3.152005 0.389743 2.313064
H  3.224988 1.901291 1.399731
H  4.524694 0.724842 1.252063
H  2.889157 1.846828 -1.162579
H  4.237776 0.71285 -1.246792
H  2.698961 0.300368 -1.983382
totalener: -3025.25571745 hartree
nucrepener: 1445.40624562 hartree
electener: -4470.66196307 hartree
oneelecener: -7074.86544535 hartree
twoeener: 2604.20348228 hartree
kineticenergy: 3018.81265158 hartree
exchangeener: -94.128185481752 hartree
correlationener: -6.529516045156 hartree
xcener: -100.657701526909 hartree
dispersion: -0.020649633 hartree
dispersion: -0.020649350 hartree
dispersion: -0.020648394 hartree
dispersion: -0.020647354 hartree
dispersion: -0.020647024 hartree
dispersion: -0.020643832 hartree
energy: -12398.5498 -1601.4871 -1436.7007 -1436.6223 -1436.6003 -680.7936 -680.7883 -398.8150 -398.7843 -285.6146 -285.6010 -283.9097 -283.8915 -283.7908 -283.7579 -283.6482 -283.6185 -224.2199 -166.7721 -166.6648 -166.5383 -64.9065 -64.8173 -64.7049 -64.6468 -64.5936 -33.6064 -33.2808 -28.2205 -27.4063 -24.4105 -23.4441 -21.3407 -21.1954 -21.0723 -21.0540 -20.4081 -17.3593 -17.1681 -15.7958 -14.9432 -14.7118 -14.3509 -14.3234 -13.8656 -13.7631 -13.2283 -13.2057 -12.5809 -12.4104 -12.2342 -12.0354 -11.8659 -11.7558 -11.5574 -11.5134 -11.3957 -11.3607 -11.1544 -10.9920 -10.8378 -10.7193 -10.4849 -10.1846 -9.3950 -8.5969 -8.0152 0.2998 2.3321 2.6276 3.1856 3.7017 4.5247 4.5703 4.7314 4.8671 5.2391 5.3347 5.5066 5.5391 5.8199 5.9950 6.0400 6.1515 6.2364 6.2726 6.4893 6.6128 6.9054 6.9424 7.0387 7.0792 7.0909 7.2206 7.4357 7.5851 7.7106 8.1493 11.2259 11.9429 12.5733 12.8385 13.0318 13.6753 13.9591 14.0296 14.4509 14.6484 15.0747 15.2471 15.6630 15.9103 16.3711 16.6562 16.7116 17.0512 17.1449 17.8938 17.9868 18.6780 19.0597 19.3255 20.0451 20.6361 21.1597 21.7081 21.9416 22.3749 22.4158 23.5643 24.1529 24.8639 26.6551 26.8463 27.1889 27.2201 27.6106 27.6535 27.7397 27.8674 27.9480 28.0701 28.1557 28.4148 28.5046 28.6636 28.8440 28.9350 29.4220 29.5504 29.7057 29.7903 29.8400 30.0827 30.3104 30.5452 31.6879 31.7497 34.3866 35.2311 35.8393 35.9048 35.9688 36.1970 36.5238 36.7895 36.9986 37.1626 37.3394 37.6885 38.3853 39.0484 39.5641 40.1713 40.6052 41.0578 41.4808 42.7127 43.4366 43.6673 44.3773 45.5108 45.8281 47.0748 47.4538 48.4771 48.6391 48.6875 49.0174 49.5278 49.5785 50.4013 51.0420 51.8676 52.0527 52.1972 52.3565 52.6960 52.9631 56.8199 57.4953 57.7576 57.8082 58.2199 58.4294 59.6924 59.9289 60.7813 61.7455 62.1745 62.3512 62.9263 63.1953 63.3724 63.4136 63.5291 63.6372 63.6634 64.2229 64.3919 64.7363 66.0579 66.5860 70.4183 72.5245 72.5790 73.3206 73.7621 74.6560 74.7572 75.0530 75.2433 77.5603 77.7402 81.8895 92.4448 93.5860 95.3517 97.2190 100.9020 369.5770 369.6881 377.4838 377.5507 377.9455 377.9808 384.0288 384.1084 523.0726 526.3257 887.6615 897.0595 electronvolt
chargesum: -0.0000000
charge: -0.706313 0.024419 -0.614648 -0.621375 -0.614942 1.335423 -0.515231 -0.516108 -0.708679 0.026533 -0.611923 -0.623106 -0.617807 0.363547 0.227053 0.222256 0.213823 0.213195 0.219794 0.240827 0.247000 0.209813 0.223785 0.364372 0.207119 0.244099 0.227014 0.240660 0.213578 0.220606 0.228132 0.215893 0.221189
charge: -0.381107 -0.048615 -0.361098 -0.345646 -0.350658 0.985273 -0.442515 -0.442482 -0.381788 -0.048073 -0.350481 -0.345864 -0.361510 0.251680 0.132637 0.128932 0.129172 0.125050 0.131812 0.137866 0.142515 0.127324 0.130105 0.252047 0.126060 0.141489 0.131488 0.137899 0.124905 0.132183 0.132826 0.130182 0.128392
qa: -0.7063 0.0244 -0.6146 -0.6214 -0.6149 1.3354 -0.5152 -0.5161 -0.7087 0.0265 -0.6119 -0.6231 -0.6178 0.3635 0.2271 0.2223 0.2138 0.2132 0.2198 0.2408 0.2470 0.2098 0.2238 0.3644 0.2071 0.2441 0.2270 0.2407 0.2136 0.2206 0.2281 0.2159 0.2212
va: 2.7778 3.8559 3.6788 3.6826 3.6896 3.4768 0.8257 0.8241 2.7785 3.8539 3.6916 3.6827 3.6758 0.8490 0.9164 0.9171 0.9144 0.9187 0.9163 0.9093 0.9104 0.9143 0.9186 0.8485 0.9144 0.9117 0.9193 0.9093 0.9186 0.9163 0.9157 0.9144 0.9168
dispersion: -0.020641107 hartree
energy: -3025.204837862668 hartree
dipole: -0.57826 0.58164 0.00337 3.83597 -3.71965 0.11632 11.08267 -10.76491 0.31776
magnitude: 0.33839 au
magnitude: 0.86013 debye
