program: Orca
programVersion: 5.0.4
elementType: N C C C C Se F N C C C C C C C C H H H H H H H H H H H H H H H H H H H H H H H H H H H H
charge: 1
multiplicity: 1
keywords: Freq RIJCOSX PBEh-3c
frequency: 0.00 0.00 0.00 0.00 0.00 0.00 32.48 42.69 47.19 80.02 108.92 134.59 172.01 191.15 201.39 220.15 228.67 247.25 255.16 264.40 271.95 298.20 316.88 318.14 322.79 332.83 341.17 346.98 362.99 369.65 379.17 404.07 412.11 427.71 437.67 452.96 464.88 468.59 474.70 501.81 513.32 550.41 597.85 611.70 675.01 764.21 813.16 854.32 859.09 942.28 955.19 960.70 963.46 964.98 966.38 970.54 984.25 995.03 998.31 1004.23 1007.57 1082.97 1084.36 1087.10 1091.34 1092.06 1112.32 1222.11 1242.62 1256.10 1281.12 1290.82 1291.93 1296.98 1304.97 1325.11 1430.76 1461.45 1465.20 1466.61 1468.13 1470.27 1471.73 1493.77 1496.67 1503.35 1524.31 1526.86 1528.20 1528.67 1532.31 1537.84 1538.75 1540.63 1549.70 1559.54 1560.60 1564.11 1567.84 1568.39 1576.59 1579.10 1587.82 1588.76 3104.25 3108.20 3116.49 3120.57 3124.25 3136.20 3140.90 3145.60 3150.39 3185.39 3188.51 3203.35 3204.08 3206.89 3207.02 3210.55 3216.03 3217.83 3218.62 3220.50 3224.69 3229.54 3235.21 3248.91 3264.12 3268.32 3271.04 3623.36
frequency: 32.48 42.69 47.19 80.02 108.92 134.59 172.01 191.15 201.39 220.15 228.67 247.25 255.16 264.40 271.95 298.20 316.88 318.14 322.79 332.83 341.17 346.98 362.99 369.65 379.17 404.07 412.11 427.71 437.67 452.96 464.88 468.59 474.70 501.81 513.32 550.41 597.85 611.70 675.01 764.21 813.16 854.32 859.09 942.28 955.19 960.70 963.46 964.98 966.38 970.54 984.25 995.03 998.31 1004.23 1007.57 1082.97 1084.36 1087.10 1091.34 1092.06 1112.32 1222.11 1242.62 1256.10 1281.12 1290.82 1291.93 1296.98 1304.97 1325.11 1430.76 1461.45 1465.20 1466.61 1468.13 1470.27 1471.73 1493.77 1496.67 1503.35 1524.31 1526.86 1528.20 1528.67 1532.31 1537.84 1538.75 1540.63 1549.70 1559.54 1560.60 1564.11 1567.84 1568.39 1576.59 1579.10 1587.82 1588.76 3104.25 3108.20 3116.49 3120.57 3124.25 3136.20 3140.90 3145.60 3150.39 3185.39 3188.51 3203.35 3204.08 3206.89 3207.02 3210.55 3216.03 3217.83 3218.62 3220.50 3224.69 3229.54 3235.21 3248.91 3264.12 3268.32 3271.04 3623.36
formula: C12H28FN2Se
InChI: InChI=1/C12H28FN2Se/c1-10(2,3)14-16(13)15(11(4,5)6)12(7,8)9/h14H,1-9H3
44 atoms
N  1.713811 -0.10419 0.023781
C  3.146626 0.118069 0.37416
C  3.392054 1.588021 0.693845
C  3.522265 -0.759982 1.565276
C  3.93612 -0.283465 -0.869312
Se 0.410151 0.892713 0.620029
F  0.294253 0.466034 2.312877
N  -1.038351 0.16752 -0.039599
C  -1.835893 1.130968 -0.926784
C  -3.284337 1.260932 -0.459284
C  -1.263767 2.558986 -0.890816
C  -1.74159 0.670319 -2.383054
C  -1.561018 -1.191094 0.425071
C  -2.324289 -1.89834 -0.698764
C  -0.428139 -2.157318 0.798126
C  -2.460894 -1.02068 1.652421
H  1.484556 -1.067971 -0.193866
H  2.915332 1.911027 1.623243
H  3.084579 2.248242 -0.11914
H  4.460456 1.741378 0.839323
H  2.960343 -0.490143 2.459545
H  4.582225 -0.650811 1.793662
H  3.344964 -1.816394 1.356256
H  5.003822 -0.172884 -0.682648
H  3.763859 -1.326863 -1.139747
H  3.674986 0.339037 -1.72439
H  -3.853486 0.337425 -0.496051
H  -3.79689 1.96327 -1.116245
H  -3.342699 1.660103 0.552902
H  -1.904526 3.1727 -1.522304
H  -1.28781 3.022781 0.097824
H  -0.262949 2.658509 -1.319338
H  -2.19183 1.425137 -3.027996
H  -2.257923 -0.261476 -2.584149
H  -0.701323 0.556706 -2.690394
H  -1.696433 -2.074261 -1.570617
H  -3.229197 -1.389622 -1.015079
H  -2.63585 -2.872614 -0.323107
H  0.202683 -1.834857 1.623654
H  0.180305 -2.43597 -0.065724
H  -0.890584 -3.084532 1.133251
H  -1.927919 -0.577616 2.490283
H  -3.34029 -0.418291 1.449694
H  -2.815405 -2.000502 1.973283
totalener: -3082.25450347 hartree
nucrepener: 1901.14830310 hartree
electener: -4983.40280657 hartree
oneelecener: -8028.88922923 hartree
twoeener: 3045.48642266 hartree
kineticenergy: 3074.92772809 hartree
exchangeener: -101.441884231434 hartree
correlationener: -7.432025721958 hartree
xcener: -108.873909953393 hartree
chargesum: 1.0000000
charge: -0.747893 0.021889 -0.684285 -0.608423 -0.608551 1.360753 -0.419826 -0.637400 0.052702 -0.641554 -0.723884 -0.608160 0.069139 -0.652043 -0.726596 -0.620313 0.411977 0.239696 0.244795 0.283390 0.241525 0.253387 0.228825 0.253577 0.230422 0.246173 0.245034 0.259017 0.245258 0.290949 0.254221 0.246616 0.246494 0.255700 0.229226 0.243826 0.246584 0.263051 0.264181 0.222883 0.284969 0.249244 0.251608 0.241817
charge: -0.352953 -0.037264 -0.364052 -0.352688 -0.343293 1.059865 -0.327926 -0.255619 -0.013460 -0.348646 -0.373083 -0.347785 -0.012619 -0.345575 -0.368224 -0.351953 0.267730 0.136944 0.140141 0.163165 0.139734 0.150636 0.135238 0.150683 0.135477 0.142593 0.135280 0.151212 0.141432 0.163645 0.140121 0.136381 0.146205 0.142037 0.135586 0.139151 0.135383 0.152047 0.140137 0.125484 0.161688 0.141767 0.140522 0.144856
qa: -0.7479 0.0219 -0.6843 -0.6084 -0.6086 1.3608 -0.4198 -0.6374 0.0527 -0.6416 -0.7239 -0.6082 0.0691 -0.6520 -0.7266 -0.6203 0.4120 0.2397 0.2448 0.2834 0.2415 0.2534 0.2288 0.2536 0.2304 0.2462 0.2450 0.2590 0.2453 0.2909 0.2542 0.2466 0.2465 0.2557 0.2292 0.2438 0.2466 0.2631 0.2642 0.2229 0.2850 0.2492 0.2516 0.2418
va: 2.8454 3.7738 3.6471 3.6397 3.6523 3.3416 0.9522 2.8730 3.7516 3.6358 3.6513 3.6251 3.7302 3.6443 3.6422 3.6232 0.8160 0.9066 0.9037 0.8953 0.9128 0.9036 0.9142 0.9042 0.9132 0.9064 0.9113 0.9011 0.9054 0.8926 0.8973 0.8995 0.9045 0.9042 0.9152 0.9052 0.9105 0.8997 0.9072 0.9137 0.8944 0.9155 0.9041 0.9066
dispersion: -0.031508898 hartree
energy: -3082.208304520872 hartree
dipole: -6.75950 6.91793 0.15843 -14.95312 14.74999 -0.20314 -14.71571 14.00331 -0.71240
magnitude: 0.75755 au
magnitude: 1.92553 debye
temp: 298.15 k
press: 1.00 atm
zeropoint: 0.40647986 hartree
thermalvibcorrection: 0.01754983 hartree
thermalrotcorrection: 0.00141627 hartree
thermaltrasncorrection: 0.00141627 hartree
thermaltotal: -3081.78144229 hartree
thermalcorr: 0.02038237 hartree
nonthermalcorr: 0.40647986 hartree
totalcorr: 0.42686223 hartree
thermalcorrenthalpy: 0.00094421 hartree
totalenthalpy: -3081.78049808 hartree
vibrat: 0.02981072 hartree
rotat: 0.01566018 hartree
transl: 0.02041926 hartree
total: 0.06589016 hartree
totalentropycorr: -0.06589016 hartree
gibbsenthalpy: -3081.84638825 hartree
gibbsminuselec: 0.36191628 hartree
