program: Orca
programVersion: 5.0.4
elementType: N C C C C Se F N C C C C C C C C H H H H H H H H H H H H H H H H H H H H H H H H H H H H
charge: 1
multiplicity: 1
keywords: SP DSD-BLYP D3BJ def2-QZVPP def2-QZVPP/C def2/J TightSCF
formula: C12H28FN2Se
InChI: InChI=1/C12H28FN2Se/c1-10(2,3)14-16(13)15(11(4,5)6)12(7,8)9/h14H,1-9H3
44 atoms
N  1.592761 -0.368927 -0.2505
C  3.025576 -0.146667 0.099878
C  3.271004 1.323285 0.419563
C  3.401215 -1.024718 1.290995
C  3.815069 -0.548202 -1.143594
Se 0.2891 0.627977 0.345747
F  0.173202 0.201298 2.038595
N  -1.159401 -0.097217 -0.313881
C  -1.956943 0.866232 -1.201066
C  -3.405387 0.996195 -0.733566
C  -1.384817 2.29425 -1.165098
C  -1.86264 0.405582 -2.657336
C  -1.682068 -1.455831 0.150789
C  -2.445339 -2.163076 -0.973046
C  -0.549189 -2.422054 0.523844
C  -2.581944 -1.285416 1.378139
H  1.363506 -1.332708 -0.468148
H  2.794282 1.64629 1.348961
H  2.963529 1.983506 -0.393422
H  4.339406 1.476642 0.565041
H  2.839293 -0.754879 2.185263
H  4.461175 -0.915548 1.51938
H  3.223913 -2.08113 1.081974
H  4.882772 -0.43762 -0.95693
H  3.642809 -1.591599 -1.414029
H  3.553935 0.0743 -1.998672
H  -3.974536 0.072689 -0.770332
H  -3.91794 1.698534 -1.390527
H  -3.463749 1.395366 0.27862
H  -2.025577 2.907963 -1.796586
H  -1.40886 2.758045 -0.176457
H  -0.3840 2.393773 -1.59362
H  -2.31288 1.160401 -3.302278
H  -2.378973 -0.526213 -2.858431
H  -0.822373 0.291969 -2.964676
H  -1.817483 -2.338997 -1.844899
H  -3.350247 -1.654359 -1.28936
H  -2.7569 -3.13735 -0.597389
H  0.081633 -2.099593 1.349372
H  0.059254 -2.700706 -0.340006
H  -1.011634 -3.349269 0.858969
H  -2.048969 -0.842352 2.216001
H  -3.46134 -0.683027 1.175412
H  -2.936455 -2.265238 1.699002
totalener: -3082.02194808 hartree
nucrepener: 1901.14830375 hartree
electener: -4983.17025183 hartree
oneelecener: -8029.45800179 hartree
twoeener: 3046.28774997 hartree
kineticenergy: 3078.56958281 hartree
exchangeener: -56.146825271211 hartree
correlationener: -3.079286887393 hartree
xcener: -59.226112158604 hartree
chargesum: 1.0000000
charge: -0.456732 0.145697 -0.159831 -0.126712 -0.136316 1.099239 -0.416823 -0.441218 0.183419 -0.162201 -0.186507 -0.143863 0.234379 -0.173091 -0.225900 -0.139769 0.203122 0.053556 0.073963 0.095004 0.071331 0.081702 0.047413 0.076914 0.043147 0.077793 0.059178 0.085814 0.071092 0.093724 0.068929 0.062764 0.077607 0.066179 0.062538 0.065631 0.061519 0.088251 0.061378 0.058740 0.094372 0.068538 0.064390 0.071643
charge: 0.306789 -0.395822 0.232255 0.252183 0.256744 1.018332 -0.084501 0.161292 -0.352576 0.256979 0.202794 0.256740 -0.339298 0.258785 0.239271 0.258030 -0.209464 -0.056043 -0.052759 -0.032457 -0.052764 -0.039818 -0.051212 -0.039958 -0.050462 -0.048506 -0.061654 -0.037138 -0.046462 -0.030326 -0.055650 -0.059809 -0.039916 -0.059876 -0.051271 -0.049372 -0.060474 -0.035893 -0.062975 -0.056750 -0.031071 -0.056367 -0.058970 -0.040580
qa: -0.4567 0.1457 -0.1598 -0.1267 -0.1363 1.0992 -0.4168 -0.4412 0.1834 -0.1622 -0.1865 -0.1439 0.2344 -0.1731 -0.2259 -0.1398 0.2031 0.0536 0.0740 0.0950 0.0713 0.0817 0.0474 0.0769 0.0431 0.0778 0.0592 0.0858 0.0711 0.0937 0.0689 0.0628 0.0776 0.0662 0.0625 0.0656 0.0615 0.0883 0.0614 0.0587 0.0944 0.0685 0.0644 0.0716
va: 2.9836 3.8682 3.8683 3.8655 3.8724 3.5451 0.8640 2.7555 3.7691 3.8752 3.8751 3.8765 3.6823 3.8728 3.8892 3.8832 1.0157 0.9930 1.0019 0.9986 1.0028 1.0020 0.9996 1.0013 1.0001 1.0025 1.0033 0.9984 1.0026 0.9948 1.0026 0.9965 1.0022 0.9989 1.0059 1.0031 1.0055 0.9971 1.0075 1.0070 1.0021 1.0099 1.0036 1.0019
total: -3083.770141393 hartree
dispersion: -0.034508219 hartree
energy: -3083.804649612370 hartree
dipole: -6.75950 6.90047 0.14097 -14.95312 14.80719 -0.14594 -14.71571 13.94613 -0.76958
magnitude: 0.79588 au
magnitude: 2.02296 debye
