program: Orca
programVersion: 5.0.4
elementType: N C C C C Se F F N C C C C C C C C H H H H H H H H H H H H H H H H H H H H H H H H H H H H
charge: 0
multiplicity: 1
keywords: Opt RIJCOSX PBEh-3c
formula: C12H28F2N2Se
InChI: InChI=1/C12H28F2N2Se/c1-10(2,3)15-17(13,14)16(11(4,5)6)12(7,8)9/h15H,1-9H3
45 atoms
N  1.784689 0.385083 -0.234446
C  3.096147 0.441686 0.464392
C  3.975704 1.268515 -0.478026
C  2.990696 1.182435 1.794646
C  3.749652 -0.928102 0.667102
Se 0.639842 -1.0212 -0.035937
F  0.787954 -0.808091 1.760875
F  0.619155 -0.982231 -1.909507
N  -1.084595 -0.445288 0.03335
C  -2.047755 -1.495222 -0.456684
C  -1.412237 -2.901906 -0.505671
C  -3.200023 -1.647929 0.553727
C  -2.584041 -1.223741 -1.866686
C  -1.392705 1.022796 0.028438
C  -2.8799 1.31185 0.282961
C  -1.01659 1.705263 -1.295031
C  -0.677368 1.719812 1.195706
H  1.919907 0.446921 -1.236806
H  4.949527 1.449145 -0.023237
H  4.146922 0.75451 -1.427007
H  3.5219 2.238202 -0.688716
H  3.983472 1.292921 2.234622
H  2.363725 0.656306 2.507544
H  2.580324 2.182363 1.64948
H  3.212931 -1.535899 1.394879
H  3.814878 -1.48173 -0.272083
H  4.766471 -0.804943 1.04312
H  -0.644996 -3.019846 -1.269116
H  -2.205645 -3.600905 -0.769976
H  -1.026033 -3.228789 0.462021
H  -3.934374 -0.85284 0.508626
H  -2.806158 -1.696959 1.568803
H  -3.738515 -2.575895 0.356926
H  -1.768175 -1.167003 -2.584162
H  -3.161413 -0.304826 -1.934998
H  -3.247677 -2.036014 -2.168259
H  -3.205233 0.95238 1.257255
H  -3.55229 0.930553 -0.480691
H  -2.998413 2.395387 0.285716
H  -1.331715 2.749828 -1.268736
H  -1.500943 1.233434 -2.147037
H  0.054834 1.701497 -1.470314
H  -0.912244 1.230907 2.139617
H  0.398468 1.755999 1.079718
H  -1.02806 2.751567 1.253401
totalener: -3182.14785160 hartree
nucrepener: 2143.90095860 hartree
electener: -5326.04881020 hartree
oneelecener: -8679.31120589 hartree
twoeener: 3353.26239569 hartree
kineticenergy: 3174.25880366 hartree
exchangeener: -107.252319683897 hartree
correlationener: -7.910136653874 hartree
xcener: -115.162456337770 hartree
dispersion: -0.033279378 hartree
dispersion: -0.033237986 hartree
dispersion: -0.033266612 hartree
dispersion: -0.033302504 hartree
dispersion: -0.033277901 hartree
dispersion: -0.033259887 hartree
dispersion: -0.033269491 hartree
dispersion: -0.033315704 hartree
dispersion: -0.033274524 hartree
dispersion: -0.033280896 hartree
dispersion: -0.033281296 hartree
chargesum: 0.0000000
charge: -0.758261 0.092506 -0.659128 -0.627208 -0.664518 1.384573 -0.494808 -0.529124 -0.611241 0.093247 -0.729950 -0.622589 -0.637857 0.091546 -0.662392 -0.621654 -0.652089 0.381992 0.230598 0.221336 0.235687 0.206873 0.260989 0.216381 0.248542 0.219930 0.224160 0.261838 0.239330 0.242924 0.229090 0.238245 0.210755 0.256232 0.215670 0.211462 0.235908 0.223169 0.230492 0.200177 0.232048 0.228404 0.234002 0.274176 0.198535
charge: -0.393752 -0.034969 -0.351613 -0.356283 -0.369201 1.020183 -0.416278 -0.468053 -0.265283 -0.014467 -0.374586 -0.351019 -0.359705 -0.014645 -0.346622 -0.357039 -0.357667 0.254632 0.135909 0.127083 0.134007 0.124054 0.144612 0.128244 0.138941 0.128041 0.133337 0.140345 0.136028 0.134393 0.128768 0.138079 0.125472 0.143883 0.121238 0.127500 0.132775 0.121820 0.133124 0.122518 0.131346 0.128814 0.136015 0.139053 0.120965
qa: -0.7583 0.0925 -0.6591 -0.6272 -0.6645 1.3846 -0.4948 -0.5291 -0.6112 0.0932 -0.7300 -0.6226 -0.6379 0.0915 -0.6624 -0.6217 -0.6521 0.3820 0.2306 0.2213 0.2357 0.2069 0.2610 0.2164 0.2485 0.2199 0.2242 0.2618 0.2393 0.2429 0.2291 0.2382 0.2108 0.2562 0.2157 0.2115 0.2359 0.2232 0.2305 0.2002 0.2320 0.2284 0.2340 0.2742 0.1985
va: 2.7835 3.8131 3.6893 3.6527 3.6659 3.4230 0.8560 0.8137 2.8550 3.8014 3.6778 3.6547 3.6400 3.8070 3.6799 3.6683 3.6671 0.8384 0.9148 0.9153 0.9102 0.9157 0.9191 0.9197 0.9134 0.9153 0.9143 0.9048 0.9107 0.9024 0.9140 0.9135 0.9167 0.9165 0.9203 0.9158 0.9076 0.9162 0.9128 0.9183 0.9103 0.9257 0.9169 0.8982 0.9182
dispersion: -0.033276799 hartree
energy: -3182.087269989078 hartree
dipole: -12.21760 12.26981 0.05221 19.22457 -19.05387 0.17070 0.67862 -0.82754 -0.14892
magnitude: 0.23247 au
magnitude: 0.59089 debye
