program: Orca
programVersion: 5.0.4
elementType: N C C C C Se N C C C C C C C C H H H H H H H H H H H H H H H H H H H H H H H H H H H H
charge: 2
multiplicity: 1
keywords: Freq RIJCOSX PBEh-3c
frequency: 0.00 0.00 0.00 0.00 0.00 0.00 29.09 45.40 65.77 74.27 98.78 146.78 163.74 170.47 195.51 206.99 226.21 234.96 241.92 258.78 266.66 281.86 300.73 311.53 321.78 328.87 343.17 354.64 360.33 406.20 409.84 418.48 426.44 433.09 464.22 466.97 472.21 498.19 537.56 578.97 588.16 659.73 719.24 805.28 815.68 825.74 845.08 907.44 950.99 955.92 957.48 957.85 959.19 967.70 977.28 1001.71 1005.80 1012.00 1064.16 1069.75 1074.29 1074.95 1080.72 1094.43 1174.05 1193.83 1202.41 1263.81 1268.91 1275.95 1280.28 1285.16 1306.96 1399.04 1455.62 1456.98 1462.61 1464.67 1466.23 1470.17 1490.42 1494.59 1500.73 1506.13 1513.50 1516.75 1517.76 1520.07 1522.96 1525.43 1530.48 1537.11 1544.30 1549.55 1554.92 1556.33 1556.90 1560.88 1567.49 1572.45 1585.30 3084.60 3095.28 3122.64 3126.24 3135.26 3138.33 3145.32 3147.38 3157.34 3167.89 3175.42 3201.89 3212.26 3213.29 3213.85 3216.15 3216.19 3221.66 3222.33 3225.69 3228.31 3231.78 3235.17 3239.59 3266.81 3287.04 3294.28 3572.44
frequency: 29.09 45.40 65.77 74.27 98.78 146.78 163.74 170.47 195.51 206.99 226.21 234.96 241.92 258.78 266.66 281.86 300.73 311.53 321.78 328.87 343.17 354.64 360.33 406.20 409.84 418.48 426.44 433.09 464.22 466.97 472.21 498.19 537.56 578.97 588.16 659.73 719.24 805.28 815.68 825.74 845.08 907.44 950.99 955.92 957.48 957.85 959.19 967.70 977.28 1001.71 1005.80 1012.00 1064.16 1069.75 1074.29 1074.95 1080.72 1094.43 1174.05 1193.83 1202.41 1263.81 1268.91 1275.95 1280.28 1285.16 1306.96 1399.04 1455.62 1456.98 1462.61 1464.67 1466.23 1470.17 1490.42 1494.59 1500.73 1506.13 1513.50 1516.75 1517.76 1520.07 1522.96 1525.43 1530.48 1537.11 1544.30 1549.55 1554.92 1556.33 1556.90 1560.88 1567.49 1572.45 1585.30 3084.60 3095.28 3122.64 3126.24 3135.26 3138.33 3145.32 3147.38 3157.34 3167.89 3175.42 3201.89 3212.26 3213.29 3213.85 3216.15 3216.19 3221.66 3222.33 3225.69 3228.31 3231.78 3235.17 3239.59 3266.81 3287.04 3294.28 3572.44
formula: C12H28N2Se
InChI: InChI=1/C12H28N2Se/c1-10(2,3)13-15-14(11(4,5)6)12(7,8)9/h13H,1-9H3
43 atoms
N  1.634498 -0.254758 -0.636454
C  3.103326 0.028579 -0.880335
C  3.872513 -0.809171 0.14161
C  3.394952 1.50981 -0.718384
C  3.369502 -0.444777 -2.308672
Se 0.548366 0.914968 -0.0172
N  -0.981804 0.234615 0.37612
C  -1.264234 -1.28434 0.356082
C  -2.613498 -1.664576 0.967872
C  -1.275175 -1.732744 -1.11251
C  -0.214527 -1.988066 1.228481
C  -2.043447 1.359921 0.613585
C  -3.04398 1.28985 -0.540784
C  -1.393258 2.74776 0.590947
C  -2.677487 1.178039 1.994476
H  1.351748 -1.21874 -0.805715
H  3.659881 -0.500968 1.165284
H  4.940171 -0.67188 -0.030658
H  3.668566 -1.875858 0.040937
H  4.450141 1.6720 -0.936467
H  2.845761 2.139244 -1.423994
H  3.252674 1.875725 0.30321
H  4.429821 -0.312085 -2.523325
H  3.150682 -1.505389 -2.441087
H  2.806889 0.129015 -3.04401
H  -2.647893 -1.520897 2.043928
H  -2.724556 -2.735083 0.795264
H  -3.474235 -1.196882 0.503489
H  -2.140877 -1.33172 -1.63722
H  -1.350766 -2.819428 -1.143197
H  -0.398496 -1.462689 -1.701379
H  -0.489573 -3.039969 1.29529
H  -0.226827 -1.593577 2.244168
H  0.81529 -1.982736 0.880809
H  -3.591244 0.355576 -0.60045
H  -3.783384 2.075496 -0.381845
H  -2.568916 1.479748 -1.503377
H  -2.193564 3.46572 0.770238
H  -0.672364 2.925794 1.394922
H  -0.975932 3.053549 -0.374369
H  -3.419616 0.391638 2.040144
H  -3.197557 2.102698 2.242122
H  -1.931568 1.016785 2.77255
totalener: -2982.16869214 hartree
nucrepener: 1667.04411916 hartree
electener: -4649.21281130 hartree
oneelecener: -7399.82499070 hartree
twoeener: 2750.61217940 hartree
kineticenergy: 2975.51767220 hartree
exchangeener: -95.595314490885 hartree
correlationener: -6.951488933500 hartree
xcener: -102.546803424385 hartree
energy: -12407.7117 -1610.8336 -1446.0034 -1445.9783 -1445.9673 -409.9122 -409.3886 -294.1350 -294.1280 -293.7943 -291.6087 -291.4533 -291.4355 -291.2178 -291.0848 -290.9753 -290.9072 -290.8853 -290.8395 -233.5809 -176.1114 -176.0070 -175.9636 -74.1981 -74.1598 -74.1444 -74.0046 -74.0025 -38.5495 -36.8514 -32.9026 -32.6956 -31.6235 -29.7457 -28.9586 -28.8691 -28.5047 -28.3225 -28.2841 -28.1249 -26.3239 -26.0035 -25.1993 -23.3356 -22.9545 -22.5216 -22.2622 -21.8458 -21.7526 -21.4614 -21.0454 -20.8795 -20.6788 -20.6535 -19.9130 -19.7858 -19.3980 -19.3335 -19.2017 -19.1463 -19.0909 -19.0786 -18.9453 -18.8282 -18.7863 -18.6610 -18.4919 -18.2239 -18.1927 -18.0936 -18.0388 -17.7016 -16.8649 -12.0063 -8.2023 -7.8080 -4.7637 -4.4823 -3.9737 -3.5640 -3.0334 -2.8024 -2.7697 -2.6031 -2.4204 -2.1832 -2.0882 -2.0228 -1.9437 -1.7967 -1.7574 -1.5420 -1.4672 -1.3633 -1.2885 -1.2211 -1.0906 -0.7597 -0.6945 -0.6459 -0.5274 -0.3942 -0.3223 -0.1432 -0.1326 0.0808 0.2599 0.2988 0.4068 0.6969 0.7109 0.8313 1.0087 1.1665 1.4462 2.0816 2.6184 3.4130 4.0477 4.4192 5.2693 5.6032 5.6976 6.3646 6.6738 6.9422 7.1231 7.2150 7.3748 7.7816 7.8343 8.0671 8.3206 8.5522 8.5968 8.8267 9.1001 9.3512 9.5117 9.7658 9.9737 10.2777 10.6835 10.7922 11.2123 11.3085 11.8573 12.0104 12.5650 12.9832 13.1972 13.6024 15.0139 15.2801 15.3865 15.4134 15.9858 16.1052 16.6427 16.9692 18.1903 18.9706 19.2811 19.9337 20.0552 20.3721 20.4502 20.5032 20.6638 20.7692 20.9870 21.1042 21.2556 21.2915 21.3521 21.5023 21.6148 21.6544 21.8075 21.9212 22.1969 22.3164 22.3792 22.6586 22.8418 22.8823 23.1626 23.4574 23.5357 23.7345 24.3438 24.6008 24.7688 25.2660 25.5623 25.7026 26.5103 28.8295 29.7949 30.1984 30.8587 31.4328 31.4693 31.9846 32.1258 32.5161 33.2565 34.2878 35.0070 35.1075 36.2419 37.0480 37.6089 38.8659 39.3170 39.7768 40.7373 40.8938 41.1035 41.2509 41.4341 41.5560 41.9359 42.5856 42.8678 44.5608 44.7521 44.8390 44.9774 45.3459 45.5933 47.8033 48.1080 48.4398 48.7765 49.2401 49.5410 50.3340 50.6477 51.0941 51.2727 51.6420 52.0809 52.4663 52.9501 53.0552 53.8910 54.2656 54.6546 55.1814 55.3852 55.7155 55.8728 55.9969 56.0911 56.1502 56.5375 56.6524 56.7621 56.8083 57.0260 57.4470 57.6116 57.8763 62.7266 63.3032 63.8934 64.4876 65.2066 65.7356 65.9604 66.5643 66.6814 66.8018 67.0477 67.3588 68.1875 69.2838 69.8357 77.2851 79.0600 80.7460 85.2880 86.6697 361.4088 361.9443 362.9780 369.7552 370.0453 370.4286 370.5602 370.8326 371.6093 374.6440 376.0412 376.2690 513.0878 515.3029 electronvolt
chargesum: 2.0000000
charge: -0.685331 -0.020682 -0.601915 -0.711693 -0.614077 1.187099 -0.513600 -0.001289 -0.676326 -0.637155 -0.666623 0.000561 -0.616592 -0.768730 -0.635530 0.450563 0.251914 0.300989 0.254885 0.335217 0.261479 0.254325 0.300384 0.254635 0.264447 0.282189 0.305310 0.269443 0.293641 0.303592 0.207119 0.313958 0.284590 0.216022 0.267036 0.302483 0.251777 0.347008 0.280071 0.268483 0.285878 0.296537 0.257911
charge: -0.248641 -0.024534 -0.340383 -0.370866 -0.340692 0.967528 -0.111645 -0.019155 -0.341484 -0.347511 -0.358592 -0.005758 -0.338369 -0.383569 -0.342353 0.294928 0.147673 0.177897 0.149319 0.191154 0.150492 0.147377 0.178054 0.149336 0.153201 0.157155 0.175224 0.147426 0.164611 0.176524 0.120776 0.181904 0.161950 0.122063 0.148046 0.178644 0.147908 0.193921 0.155691 0.150610 0.158524 0.173525 0.152088
qa: -0.6853 -0.0207 -0.6019 -0.7117 -0.6141 1.1871 -0.5136 -0.0013 -0.6763 -0.6372 -0.6666 0.0006 -0.6166 -0.7687 -0.6355 0.4506 0.2519 0.3010 0.2549 0.3352 0.2615 0.2543 0.3004 0.2546 0.2644 0.2822 0.3053 0.2694 0.2936 0.3036 0.2071 0.3140 0.2846 0.2160 0.2670 0.3025 0.2518 0.3470 0.2801 0.2685 0.2859 0.2965 0.2579
va: 3.0164 3.6969 3.5899 3.6023 3.5923 3.0259 3.0635 3.6393 3.5946 3.5999 3.6044 3.6547 3.5801 3.5938 3.5755 0.7902 0.9040 0.8845 0.9038 0.8717 0.8952 0.8978 0.8851 0.9038 0.8980 0.8880 0.8799 0.9011 0.8858 0.8822 0.9220 0.8791 0.8892 0.9197 0.9042 0.8819 0.9035 0.8659 0.8836 0.8886 0.8895 0.8844 0.9015
dispersion: -0.030184505 hartree
energy: -2982.129024283474 hartree
dipole: -8.46610 8.55020 0.08410 -14.61896 14.30179 -0.31717 0.18528 -0.30604 -0.12075
magnitude: 0.34965 au
magnitude: 0.88873 debye
temp: 298.15 k
press: 1.00 atm
zeropoint: 0.40085757 hartree
thermalvibcorrection: 0.01700319 hartree
thermalrotcorrection: 0.00141627 hartree
thermaltrasncorrection: 0.00141627 hartree
thermaltotal: -2981.70833098 hartree
thermalcorr: 0.01983573 hartree
nonthermalcorr: 0.40085757 hartree
totalcorr: 0.42069330 hartree
thermalcorrenthalpy: 0.00094421 hartree
totalenthalpy: -2981.70738678 hartree
vibrat: 0.02912918 hartree
rotat: 0.01556857 hartree
transl: 0.02032607 hartree
total: 0.06502381 hartree
totalentropycorr: -0.06502381 hartree
gibbsenthalpy: -2981.77241059 hartree
gibbsminuselec: 0.35661369 hartree
