program: Orca
programVersion: 5.0.4
elementType: N C C C C Se N C C C C C C C C H H H H H H H H H H H H H H H H H H H H H H H H H H H H
charge: 2
multiplicity: 1
keywords: SP DSD-BLYP D3BJ def2-QZVPP def2-QZVPP/C def2/J TightSCF
formula: C12H28N2Se
InChI: InChI=1/C12H28N2Se/c1-10(2,3)13-15-14(11(4,5)6)12(7,8)9/h13H,1-9H3
43 atoms
N  1.482023 -0.516661 -0.632631
C  2.950851 -0.233324 -0.876512
C  3.720038 -1.071073 0.145433
C  3.242478 1.247908 -0.714562
C  3.217027 -0.706679 -2.304849
Se 0.395891 0.653065 -0.013377
N  -1.134279 -0.027287 0.379942
C  -1.416709 -1.546243 0.359904
C  -2.765973 -1.926479 0.971695
C  -1.42765 -1.994646 -1.108687
C  -0.367002 -2.249969 1.232304
C  -2.195921 1.098019 0.617408
C  -3.196455 1.027948 -0.536961
C  -1.545733 2.485857 0.59477
C  -2.829962 0.916137 1.998298
H  1.199274 -1.480642 -0.801893
H  3.507406 -0.762871 1.169106
H  4.787696 -0.933782 -0.026835
H  3.516091 -2.137761 0.044759
H  4.297667 1.410097 -0.932644
H  2.693286 1.877342 -1.420171
H  3.100199 1.613823 0.307032
H  4.277346 -0.573987 -2.519502
H  2.998208 -1.767292 -2.437264
H  2.654414 -0.132887 -3.040187
H  -2.800367 -1.782799 2.047751
H  -2.877031 -2.996985 0.799087
H  -3.626709 -1.458784 0.507312
H  -2.293352 -1.593622 -1.633398
H  -1.503241 -3.08133 -1.139374
H  -0.550971 -1.724592 -1.697557
H  -0.642048 -3.301871 1.299113
H  -0.379302 -1.855479 2.24799
H  0.662815 -2.244638 0.884632
H  -3.743719 0.093674 -0.596628
H  -3.935859 1.813594 -0.378023
H  -2.72139 1.217846 -1.499554
H  -2.346039 3.203818 0.77406
H  -0.824838 2.663891 1.398745
H  -1.128407 2.791647 -0.370547
H  -3.572091 0.129736 2.043966
H  -3.350032 1.840796 2.245945
H  -2.084043 0.754883 2.776372
totalener: -2981.92262174 hartree
nucrepener: 1667.04411867 hartree
electener: -4648.96674040 hartree
oneelecener: -7400.61822139 hartree
twoeener: 2751.65148099 hartree
kineticenergy: 2978.63729451 hartree
exchangeener: -52.897597109630 hartree
correlationener: -2.872319929376 hartree
xcener: -55.769917039006 hartree
chargesum: 2.0000000
charge: -0.322495 0.057294 -0.085100 -0.123213 -0.110215 0.885165 -0.262400 0.153065 -0.160414 -0.135176 -0.191220 0.114599 -0.138545 -0.172050 -0.144688 0.250297 0.073939 0.110725 0.059919 0.123159 0.066354 0.057706 0.110196 0.056446 0.087741 0.095978 0.110504 0.071575 0.106963 0.121077 0.020172 0.125634 0.109151 0.032187 0.082395 0.121209 0.077663 0.126837 0.084050 0.075239 0.091676 0.109652 0.076948
charge: 0.338651 -0.365152 0.276579 0.240955 0.280170 1.286483 0.217834 -0.317795 0.279806 0.269855 0.264356 -0.323733 0.281749 0.212759 0.286726 -0.172752 -0.046767 -0.022912 -0.043802 -0.014907 -0.047956 -0.050713 -0.022927 -0.043118 -0.043679 -0.040590 -0.020356 -0.052890 -0.035681 -0.023242 -0.067104 -0.019447 -0.038177 -0.073644 -0.055158 -0.020139 -0.043872 -0.012015 -0.046363 -0.052891 -0.050912 -0.024779 -0.042448
qa: -0.3225 0.0573 -0.0851 -0.1232 -0.1102 0.8852 -0.2624 0.1531 -0.1604 -0.1352 -0.1912 0.1146 -0.1385 -0.1720 -0.1447 0.2503 0.0739 0.1107 0.0599 0.1232 0.0664 0.0577 0.1102 0.0564 0.0877 0.0960 0.1105 0.0716 0.1070 0.1211 0.0202 0.1256 0.1092 0.0322 0.0824 0.1212 0.0777 0.1268 0.0841 0.0752 0.0917 0.1097 0.0769
va: 3.2151 3.9191 3.8546 3.8691 3.8488 3.4019 3.0299 3.7142 3.8764 3.8789 3.8792 3.8272 3.8819 3.8824 3.8658 0.9885 0.9977 0.9992 0.9962 0.9966 0.9970 0.9924 0.9990 0.9978 0.9979 0.9903 0.9928 1.0067 1.0030 1.0002 1.0147 0.9994 1.0021 1.0138 1.0065 0.9956 1.0001 0.9939 0.9950 0.9911 0.9930 0.9961 1.0057
total: -2983.542889720 hartree
dispersion: -0.033198648 hartree
energy: -2983.576088367802 hartree
dipole: -8.46610 8.54453 0.07843 -14.61896 14.37109 -0.24788 0.18528 -0.29619 -0.11090
magnitude: 0.28265 au
magnitude: 0.71845 debye
