program: Orca
programVersion: 5.0.4
elementType: N Se F N C C H H H H H H H H
charge: 1
multiplicity: 1
keywords: SP DSD-BLYP D3BJ def2-QZVPP def2-QZVPP/C def2/J TightSCF
formula: C2H8FN2Se
InChI: InChI=1/C2H8FN2Se/c1-2-5-6(3)4/h5H,2,4H2,1H3
14 atoms
N  1.093959 -0.612758 1.280518
Se 0.706993 -0.176857 -0.364456
F  1.004009 1.523921 -0.329904
N  -1.019122 -0.281243 -0.312539
C  -1.894209 0.147823 0.797397
C  -3.324564 -0.237933 0.476015
H  2.059195 -0.882754 1.439192
H  0.69891 -0.084554 2.052563
H  -1.44442 -0.274461 -1.235773
H  -1.81062 1.224564 0.956326
H  -1.576269 -0.371165 1.702151
H  -3.967407 0.060369 1.302189
H  -3.691827 0.269149 -0.41648
H  -3.428902 -1.31339 0.343365
totalener: -2690.18610165 hartree
nucrepener: 515.90732625 hartree
electener: -3206.09342789 hartree
oneelecener: -4748.64401622 hartree
twoeener: 1542.55058832 hartree
kineticenergy: 2687.77544437 hartree
exchangeener: -37.833416358428 hartree
correlationener: -1.672041184241 hartree
xcener: -39.505457542670 hartree
chargesum: 1.0000000
charge: -0.429264 1.189436 -0.374398 -0.373906 0.027984 -0.152105 0.225302 0.237058 0.212191 0.112289 0.091165 0.092103 0.049816 0.092330
charge: 0.417006 0.961288 -0.069229 0.273159 -0.016849 0.258572 -0.191816 -0.190431 -0.191501 -0.052172 -0.052731 -0.040891 -0.053762 -0.050645
qa: -0.4293 1.1894 -0.3744 -0.3739 0.0280 -0.1521 0.2253 0.2371 0.2122 0.1123 0.0912 0.0921 0.0498 0.0923
va: 3.1230 3.5328 0.9348 3.0745 3.7960 3.9073 1.0024 0.9985 1.0089 0.9721 0.9755 1.0034 0.9970 0.9971
total: -2690.995107179 hartree
dispersion: -0.008084391 hartree
energy: -2691.003191569656 hartree
dipole: -20.55066 20.30654 -0.24412 -0.88492 0.24666 -0.63826 9.82403 -9.24118 0.58286
magnitude: 0.89816 au
magnitude: 2.28294 debye
