program: Orca
programVersion: 5.0.4
elementType: N Se N C C O H H H H H H H H
charge: 0
multiplicity: 1
keywords: Freq RIJCOSX PBEh-3c
frequency: 0.00 0.00 0.00 0.00 0.00 0.00 62.60 104.44 184.74 242.74 272.51 298.05 330.23 405.57 467.36 560.86 625.93 727.39 791.40 844.58 929.67 1007.49 1054.58 1111.44 1155.29 1182.76 1333.76 1408.58 1465.32 1476.74 1540.94 1550.54 1553.09 1648.10 3112.63 3116.82 3165.71 3197.50 3199.30 3558.37 3594.73 3678.91
frequency: 62.60 104.44 184.74 242.74 272.51 298.05 330.23 405.57 467.36 560.86 625.93 727.39 791.40 844.58 929.67 1007.49 1054.58 1111.44 1155.29 1182.76 1333.76 1408.58 1465.32 1476.74 1540.94 1550.54 1553.09 1648.10 3112.63 3116.82 3165.71 3197.50 3199.30 3558.37 3594.73 3678.91
formula: C2H8N2OSe
InChI: InChI=1/C2H8N2OSe/c1-2-4-6(3)5/h4H,2-3H2,1H3
14 atoms
N  2.224608 0.408448 -0.711485
Se 1.313068 0.831459 0.820563
N  0.249216 -0.659959 0.600695
C  -0.834746 -0.585613 -0.367244
C  -2.025599 0.279767 0.02667
O  2.155459 0.436808 2.132847
H  2.667294 -0.503517 -0.646096
H  2.914255 1.110891 -0.954452
H  -0.060089 -0.969269 1.517195
H  -1.170557 -1.610283 -0.54643
H  -0.413788 -0.245778 -1.315557
H  -1.744335 1.326153 0.154606
H  -2.801085 0.241808 -0.739329
H  -2.473801 -0.060718 0.961718
totalener: -2665.58796299 hartree
nucrepener: 502.80028646 hartree
electener: -3168.38824945 hartree
oneelecener: -4703.69409328 hartree
twoeener: 1535.30584384 hartree
kineticenergy: 2661.97898130 hartree
exchangeener: -67.745975709575 hartree
correlationener: -3.985396509072 hartree
xcener: -71.731372218647 hartree
energy: -12397.6783 -1600.7570 -1435.9309 -1435.9268 -1435.8730 -529.1692 -398.5564 -398.5015 -285.0320 -283.9556 -223.5670 -166.0928 -166.0739 -165.9006 -64.2357 -64.2106 -64.0708 -64.0283 -63.9818 -29.6012 -27.1159 -26.2233 -22.6429 -19.8574 -18.7087 -15.7083 -14.9206 -14.2319 -13.6567 -12.9879 -12.7126 -11.7766 -11.4951 -10.9897 -9.6190 -8.8972 -8.3732 -7.5419 0.8754 1.9578 3.1007 3.7839 4.4130 4.8096 5.2561 5.4126 5.6637 5.8082 6.1559 6.6591 7.6864 9.6968 12.5840 12.6288 13.3986 13.6263 14.3943 14.7184 15.3901 16.5906 16.8721 17.5882 17.6957 19.7120 21.8990 22.2111 23.3631 23.9257 25.2652 26.0266 26.9074 27.3134 27.4035 27.8176 28.5411 28.7993 29.0838 29.2473 29.2963 30.4795 31.0700 31.6335 33.5967 34.3021 39.0689 40.7426 41.2049 43.2782 44.9570 47.6316 48.3656 49.3478 51.8267 52.1340 52.7482 53.2985 54.1977 55.5959 56.5804 57.2451 58.8917 59.5523 60.3599 61.3681 62.7026 63.8638 66.1203 67.0628 67.3140 68.3771 69.3000 72.9090 75.3057 89.0092 89.7742 92.0294 93.9145 96.9921 371.1781 379.7164 518.8457 521.6886 695.8173 electronvolt
chargesum: 0.0000000
charge: -0.911768 1.069746 -0.717623 -0.298962 -0.654013 -0.689076 0.365955 0.352075 0.353740 0.231583 0.242428 0.219690 0.222937 0.213291
charge: -0.591568 0.804263 -0.434225 -0.183236 -0.386297 -0.577629 0.243979 0.236569 0.243333 0.127299 0.132962 0.126482 0.132829 0.125237
qa: -0.9118 1.0697 -0.7176 -0.2990 -0.6540 -0.6891 0.3660 0.3521 0.3537 0.2316 0.2424 0.2197 0.2229 0.2133
va: 2.7119 3.5949 2.7961 3.7547 3.7175 1.8619 0.8456 0.8456 0.8453 0.8991 0.9046 0.9129 0.9117 0.9136
dispersion: -0.006526208 hartree
energy: -2665.563373657072 hartree
dipole: -13.94818 13.29178 -0.65640 -8.06470 8.16185 0.09715 -8.25208 7.26685 -0.98523
magnitude: 1.18784 au
magnitude: 3.01925 debye
temp: 298.15 k
press: 1.00 atm
zeropoint: 0.11609696 hartree
thermalvibcorrection: 0.00522925 hartree
thermalrotcorrection: 0.00141627 hartree
thermaltrasncorrection: 0.00141627 hartree
thermaltotal: -2665.43921491 hartree
thermalcorr: 0.00806179 hartree
nonthermalcorr: 0.11609696 hartree
totalcorr: 0.12415875 hartree
thermalcorrenthalpy: 0.00094421 hartree
totalenthalpy: -2665.43827070 hartree
vibrat: 0.00890987 hartree
rotat: 0.01324177 hartree
transl: 0.01949247 hartree
total: 0.04164412 hartree
totalentropycorr: -0.04164412 hartree
gibbsenthalpy: -2665.47991481 hartree
gibbsminuselec: 0.08345884 hartree
