program: Orca
programVersion: 5.0.4
elementType: N Se N C C O H H H H H H H H
charge: 0
multiplicity: 1
keywords: Opt RIJCOSX PBEh-3c
formula: C2H8N2OSe
InChI: InChI=1/C2H8N2OSe/c1-2-4-6(3)5/h4H,2-3H2,1H3
14 atoms
N  2.224608 0.408448 -0.711485
Se 1.313068 0.831459 0.820563
N  0.249216 -0.659959 0.600695
C  -0.834746 -0.585613 -0.367244
C  -2.025599 0.279767 0.02667
O  2.155459 0.436808 2.132847
H  2.667294 -0.503517 -0.646096
H  2.914255 1.110891 -0.954452
H  -0.060089 -0.969269 1.517195
H  -1.170557 -1.610283 -0.54643
H  -0.413788 -0.245778 -1.315557
H  -1.744335 1.326153 0.154606
H  -2.801085 0.241808 -0.739329
H  -2.473801 -0.060718 0.961718
totalener: -2665.58798480 hartree
nucrepener: 502.79831906 hartree
electener: -3168.38630386 hartree
oneelecener: -4703.68496336 hartree
twoeener: 1535.29865950 hartree
kineticenergy: 2661.97846467 hartree
exchangeener: -67.745872419773 hartree
correlationener: -3.985393979615 hartree
xcener: -71.731266399388 hartree
dispersion: -0.006527849 hartree
dispersion: -0.006524765 hartree
dispersion: -0.006525777 hartree
energy: -12397.6794 -1600.7581 -1435.9320 -1435.9279 -1435.8741 -529.1695 -398.5566 -398.5014 -285.0322 -283.9558 -223.5676 -166.0934 -166.0745 -165.9012 -64.2363 -64.2113 -64.0714 -64.0289 -63.9824 -29.6013 -27.1160 -26.2233 -22.6431 -19.8575 -18.7088 -15.7083 -14.9206 -14.2320 -13.6568 -12.9880 -12.7127 -11.7766 -11.4952 -10.9898 -9.6191 -8.8973 -8.3732 -7.5421 0.8753 1.9577 3.1006 3.7838 4.4130 4.8095 5.2561 5.4126 5.6637 5.8081 6.1558 6.6591 7.6864 9.6967 12.5839 12.6286 13.3985 13.6262 14.3942 14.7183 15.3900 16.5905 16.8720 17.5880 17.6956 19.7120 21.8990 22.2110 23.3630 23.9257 25.2652 26.0265 26.9073 27.3134 27.4035 27.8175 28.5411 28.7992 29.0838 29.2472 29.2962 30.4794 31.0699 31.6334 33.5966 34.3020 39.0688 40.7425 41.2049 43.2781 44.9568 47.6316 48.3655 49.3477 51.8266 52.1339 52.7481 53.2984 54.1976 55.5958 56.5803 57.2450 58.8916 59.5522 60.3598 61.3680 62.7026 63.8637 66.1202 67.0627 67.3140 68.3770 69.3000 72.9088 75.3056 89.0089 89.7738 92.0291 93.9142 96.9918 371.1780 379.7162 518.8458 521.6884 695.8171 electronvolt
chargesum: -0.0000000
charge: -0.911776 1.069756 -0.717620 -0.298956 -0.654003 -0.689077 0.365954 0.352074 0.353737 0.231579 0.242424 0.219688 0.222932 0.213288
charge: -0.591574 0.804271 -0.434222 -0.183231 -0.386290 -0.577629 0.243978 0.236568 0.243331 0.127296 0.132959 0.126480 0.132826 0.125235
qa: -0.9118 1.0698 -0.7176 -0.2990 -0.6540 -0.6891 0.3660 0.3521 0.3537 0.2316 0.2424 0.2197 0.2229 0.2133
va: 2.7119 3.5949 2.7961 3.7547 3.7175 1.8619 0.8456 0.8456 0.8453 0.8991 0.9046 0.9129 0.9117 0.9136
dispersion: -0.006526208 hartree
energy: -2665.563373633682 hartree
dipole: -13.94818 13.29177 -0.65641 -8.06470 8.16186 0.09716 -8.25208 7.26689 -0.98518
magnitude: 1.18782 au
magnitude: 3.01919 debye
