program: Orca
programVersion: 5.0.4
elementType: N Se N C C H H H H H H H H
charge: 2
multiplicity: 1
keywords: Freq RIJCOSX PBEh-3c
frequency: 0.00 0.00 0.00 0.00 0.00 0.00 101.51 168.87 189.01 265.42 336.44 407.61 516.60 628.53 731.75 789.12 803.72 884.80 926.34 1008.46 1032.07 1129.08 1136.32 1293.56 1359.52 1437.22 1471.93 1485.04 1506.60 1530.50 1640.21 3069.07 3080.04 3124.06 3159.04 3197.12 3441.85 3466.37 3560.73
frequency: 101.51 168.87 189.01 265.42 336.44 407.61 516.60 628.53 731.75 789.12 803.72 884.80 926.34 1008.46 1032.07 1129.08 1136.32 1293.56 1359.52 1437.22 1471.93 1485.04 1506.60 1530.50 1640.21 3069.07 3080.04 3124.06 3159.04 3197.12 3441.85 3466.37 3560.73
formula: C2H8N2Se
InChI: InChI=1/C2H8N2Se/c1-2-4-5-3/h4H,2-3H2,1H3
13 atoms
N  2.774726 -0.137434 0.658012
Se 1.103902 0.145409 0.851258
N  0.370992 -0.546591 -0.513074
C  -1.097315 -0.477969 -0.730803
C  -1.839923 0.23722 0.363779
H  3.408396 0.197448 1.394538
H  3.238984 -0.6127 -0.123046
H  0.91816 -1.023292 -1.242768
H  -1.214613 0.005402 -1.709112
H  -1.415291 -1.521433 -0.849609
H  -1.775793 -0.263504 1.335735
H  -2.901082 0.234009 0.109727
H  -1.571245 1.295537 0.455462
totalener: -2589.77694431 hartree
nucrepener: 385.93197480 hartree
electener: -2975.70891911 hartree
oneelecener: -4335.41180788 hartree
twoeener: 1359.70288877 hartree
kineticenergy: 2586.62525494 hartree
exchangeener: -62.776998302420 hartree
correlationener: -3.525348402621 hartree
xcener: -66.302346705041 hartree
energy: -12410.8747 -1614.0143 -1449.1784 -1449.1644 -1449.1401 -412.6009 -411.7512 -295.4989 -293.0199 -236.7665 -179.2827 -179.2099 -179.1366 -77.3663 -77.3357 -77.3333 -77.1931 -77.1884 -41.3903 -39.1026 -33.8549 -32.3958 -29.1921 -28.5754 -27.7704 -25.2093 -25.0474 -24.4197 -23.3508 -21.7730 -21.3050 -20.8489 -20.0130 -14.7034 -10.9803 -10.0824 -7.2164 -5.8033 -5.0790 -4.9661 -4.0679 -3.5486 -3.5436 -2.9394 -2.7719 -2.1071 -1.7545 0.6474 1.3902 1.7118 2.8771 3.5815 3.7456 4.3287 5.7519 6.1790 7.1203 8.0033 8.8129 9.4026 10.8846 11.3149 12.9563 14.3192 14.8068 15.6102 16.6307 17.3477 17.6147 18.8946 19.2556 19.4896 19.8567 20.4473 21.2103 22.7705 26.5256 28.4853 29.3851 33.0799 33.7868 35.9021 37.6438 38.9427 41.5944 42.0716 44.2805 46.9295 48.0371 48.3813 49.0754 51.0358 53.3105 54.0107 54.6656 56.7178 57.2117 62.3724 63.4460 73.3127 73.9184 77.0054 80.0909 81.3280 361.3814 369.9359 504.7797 507.9227 electronvolt
chargesum: 2.0000000
charge: -0.812495 1.342384 -0.634312 -0.313090 -0.775315 0.513741 0.498250 0.492844 0.367755 0.368753 0.283298 0.386388 0.281800
charge: -0.374361 1.125758 -0.199572 -0.133288 -0.394673 0.347235 0.332644 0.331232 0.206606 0.206904 0.166432 0.219146 0.165938
qa: -0.8125 1.3424 -0.6343 -0.3131 -0.7753 0.5137 0.4982 0.4928 0.3678 0.3688 0.2833 0.3864 0.2818
va: 3.0148 3.0219 3.1338 3.4330 3.5944 0.7253 0.7429 0.7393 0.8286 0.8282 0.8809 0.8394 0.8816
dispersion: -0.005571488 hartree
energy: -2589.755643475929 hartree
dipole: -10.68476 11.60338 0.91862 -3.13745 2.51625 -0.62120 -8.06726 7.12110 -0.94616
magnitude: 1.45773 au
magnitude: 3.70525 debye
temp: 298.15 k
press: 1.00 atm
zeropoint: 0.11135339 hartree
thermalvibcorrection: 0.00394885 hartree
thermalrotcorrection: 0.00141627 hartree
thermaltrasncorrection: 0.00141627 hartree
thermaltotal: -2589.63750869 hartree
thermalcorr: 0.00678139 hartree
nonthermalcorr: 0.11135339 hartree
totalcorr: 0.11813478 hartree
thermalcorrenthalpy: 0.00094421 hartree
totalenthalpy: -2589.63656448 hartree
vibrat: 0.00665325 hartree
rotat: 0.01269845 hartree
transl: 0.01933824 hartree
total: 0.03868994 hartree
totalentropycorr: -0.03868994 hartree
gibbsenthalpy: -2589.67525442 hartree
gibbsminuselec: 0.08038906 hartree
