program: Orca
programVersion: 5.0.4
elementType: N Se N C C H H H H H H H H
charge: 2
multiplicity: 1
keywords: SP DSD-BLYP D3BJ def2-QZVPP def2-QZVPP/C def2/J TightSCF
formula: C2H8N2Se
InChI: InChI=1/C2H8N2Se/c1-2-4-5-3/h4H,2-3H2,1H3
13 atoms
N  2.094263 -0.118068 0.196312
Se 0.423439 0.164775 0.389558
N  -0.309471 -0.527225 -0.974773
C  -1.777778 -0.458604 -1.192502
C  -2.520386 0.256586 -0.097921
H  2.727933 0.216814 0.932839
H  2.558521 -0.593335 -0.584745
H  0.237697 -1.003926 -1.704467
H  -1.895076 0.024768 -2.170811
H  -2.095754 -1.502067 -1.311308
H  -2.456256 -0.244139 0.874036
H  -3.581545 0.253375 -0.351972
H  -2.251708 1.314903 -0.006237
totalener: -2590.00616398 hartree
nucrepener: 385.93197405 hartree
electener: -2975.93813803 hartree
oneelecener: -4336.11086508 hartree
twoeener: 1360.17272705 hartree
kineticenergy: 2587.75604313 hartree
exchangeener: -34.584483515795 hartree
correlationener: -1.466942167406 hartree
xcener: -36.051425683200 hartree
chargesum: 2.0000000
charge: -0.310648 1.145618 -0.228205 0.054994 -0.138991 0.299746 0.289846 0.271836 0.160726 0.161417 0.069631 0.156603 0.067426
charge: 0.475340 1.342562 0.364499 0.043438 0.247791 -0.121408 -0.127181 -0.113173 -0.007211 -0.007193 -0.045378 -0.006674 -0.045411
qa: -0.3106 1.1456 -0.2282 0.0550 -0.1390 0.2997 0.2898 0.2718 0.1607 0.1614 0.0696 0.1566 0.0674
va: 3.3823 3.3140 3.4397 3.7250 3.9074 0.9469 0.9571 0.9571 0.9685 0.9689 0.9981 0.9937 0.9979
total: -2590.680869744 hartree
dispersion: -0.007619040 hartree
energy: -2590.688488784048 hartree
dipole: -10.68476 11.62069 0.93593 -3.13745 2.56154 -0.57591 -8.06726 7.20897 -0.85829
magnitude: 1.39438 au
magnitude: 3.54423 debye
