program: Gaussian 09
title: 000076428
version: EM64L-G09RevD.01
frameworkgroup: C1[X(C4H4N2O)]
method: RPBEPBE
basis: SDD
operation: Freq
keyword: #pfreq=noraman
keyword: PBEPBE/SDD
title: #p freq=noraman PBEPBE/SDD
converged: NO YES NO NO
title: Mulliken charges:
elementType: O N N C C C C H H H H
charge: -0.187607 -0.398283 -0.070665 0.302175 -0.323632 -0.187860 -0.154807 0.318819 0.286190 0.267009 0.148660
chargesum: 0.00000
title: Mulliken charges with hydrogens summed into heavy atoms:
elementType: O N N C C C C
charge: -0.187607 -0.079464 -0.070665 0.302175 -0.037441 0.079149 -0.006147
polarizability: 8.88355025e+01 1.04434615e+00 5.85942336e+01 4.89310395e-03 -1.30420123e-03 2.45849681e+01
1716.lowfreq: -6.4017 -0.0003 0.0005 0.0007 8.8692 14.0801 151.7145 191.0473 249.2409
frequency: 151.7073 191.0429 249.2389 483.9319 622.3484 645.6106 677.3107 735.7518 807.1813 866.4219 890.5300 968.2240 989.7510 1096.1886 1124.9196 1216.3071 1250.0592 1290.4377 1370.4510 1394.8351 1410.7542 1534.5235 1610.5599 2843.5460 3240.4768 3246.4822 3575.5481
redmass: 4.4748 6.0205 2.7045 7.2893 3.6416 2.7708 1.1843 5.4055 1.4521 1.4322 6.0424 1.7845 3.7605 1.9970 1.6820 1.8059 2.4774 4.1071 2.6323 1.7805 2.2478 4.3690 6.9241 1.0830 1.0965 1.1021 1.0820
irintensity: 4.3799 6.8671 2.3934 3.4918 0.3141 62.0300 93.2287 51.6028 22.1896 22.8643 2.9913 2.2263 5.8086 66.8206 17.2377 9.7119 24.5497 27.2159 5.0931 20.3615 82.9888 53.3558 248.4897 139.4220 0.4051 1.5427 48.8777
temp: 298.150 k
press: 1.00000 atm
elementType: 8 7 7 6 6 6 6 1 1 1 1
symmnumber: 1
zpe: 206261.0 jmol-1
zpe.correction: 0.078561 hartree
zpe.thermalcorrener: 0.084231 hartree
zpe.thermalcorrenthalpy: 0.085175 hartree
zpe.thermalcorrgfe: 0.048936 hartree
zpe.sumelectzpe: -339.025894 hartree
zpe.sumelectthermal: -339.020224 hartree
zpe.sumelectthermalent: -339.019280 hartree
zpe.sumelectthermalfe: -339.055519 hartree
dipole: 2.0694 4.7401 -0.0034
dipole: 5.1721
quadrupole: -50.7474 -33.7040 -41.6430
quadrupole: 3.6050 0.0120 0.0088
quadrupole: -8.7160 8.3275 0.3885 3.6050 0.0120 0.0088
hfenergy: -339.1044548 hartree
pointgroup: C01 [X(C4H4N2O1)]
dipole: 0.781934 1.8786207 -0.0021467 debye
dipolederiv: -1.0878978 -0.0560689 -0.0010119 -0.4471758 -0.4808736 -0.0009301 0.0025631 0.0009353 -0.332039 0.1162588 0.1031592 -0.0000242 0.119787 -0.5763131 0.000035 -0.0004979 0.0003397 -0.2216323 -0.5658273 -0.0353978 0.0000097 -0.2833883 -0.4381411 -0.0000872 0.0000394 -0.0000918 -0.2705028 -0.9835184 0.2696388 0.0000466 0.5142601 0.0645245 0.0001785 -0.0006966 -0.0001686 -0.0120283 0.4587834 0.0257792 0.0002787 -0.1392789 0.175731 -0.0000748 0.0000836 0.0001897 -0.0940029 -0.0005811 -0.1719772 0.0003205 0.191896 0.4752395 -0.0000751 -0.0000588 -0.000098 -0.0611666 1.7081464 -0.090817 0.0006325 0.0259928 0.7897283 0.0016753 -0.0020989 0.0009079 0.1446718 0.1992882 0.0625607 -0.0001351 0.0196194 0.1979252 0.0000009 -0.0000701 -0.000068 0.3614004 0.088318 -0.0310444 -0.0000429 -0.0535315 0.0524688 -0.0000352 -0.0000254 -0.0000621 0.185406 0.0511283 -0.0605825 -0.0000739 -0.0555134 0.0560111 -0.0000669 -0.0000712 -0.0000309 0.1978122 0.0159015 -0.0152502 0. 0.1073324 -0.3163005 -0.0006203 0.0008328 -0.0018531 0.1020816 unknown
polarizability: 88.7906097|1.5640553|58.6391205|-0.001351|-0.0146478|24.584974 unknown
InChI: InChI=1S/C4H4N2O/c7-2-4-1-5-3-6-4/h1-3,6H
charge 0 multiplicity 1
11 atoms
O  -2.68085 -0.366153 0.002384
N  0.689312 1.140703 -0.000439
N  1.744051 -0.862823 0.00063
C  -0.327647 0.160586 -0.001216
C  0.367345 -1.068468 -0.000349
C  1.904971 0.485633 0.000557
C  -1.749946 0.486711 -0.002508
H  0.542387 2.150438 -0.000745
H  -0.064709 -2.066046 -0.000557
H  2.863694 0.99921 0.00114
H  -1.978407 1.585409 0.002203
