program: Orca
programVersion: 5.0.4
elementType: Se H H
charge: 2
multiplicity: 1
keywords: SP DSD-BLYP D3BJ def2-QZVPP def2-QZVPP/C def2/J TightSCF
formula: H2Se
InChI: InChI=1/H2Se/h1H2
3 atoms
Se -0.000077 0.025924 0.0000
H  -1.093132 -1.018674 0.0000
H  1.099196 -1.012141 0.0000
totalener: -2400.92825820 hartree
nucrepener: 24.04127123 hartree
electener: -2424.96952942 hartree
oneelecener: -3366.52579865 hartree
twoeener: 941.55626923 hartree
kineticenergy: 2399.30746669 hartree
exchangeener: -26.562427380210 hartree
correlationener: -0.881934159137 hartree
xcener: -27.444361539347 hartree
energy: -12488.8124 -1644.0628 -1474.7321 -1474.6010 -1474.5966 -251.7543 -192.4875 -192.0157 -191.9457 -87.1832 -87.0304 -86.9517 -86.4891 -86.4501 -40.9779 -30.6209 -28.9460 -20.3764 -13.2231 -12.0549 -8.0167 -6.9462 -6.8159 -6.5736 -6.4993 -6.0088 -5.8959 -2.8832 -2.6263 -0.3306 1.1583 3.8645 4.2983 4.8908 5.9105 9.0930 9.5157 9.8543 12.8621 13.0092 14.4130 14.6547 15.2867 15.3931 15.4431 16.0124 19.0653 19.8359 21.0307 21.0607 22.0796 22.7169 24.2763 30.8550 37.2852 38.1566 39.1361 39.8570 41.3468 41.7216 43.0162 45.3301 46.0878 46.9068 49.3046 50.0141 52.6173 52.6221 52.8201 53.1913 53.6426 56.2236 56.2545 59.1429 59.5389 60.3359 60.9545 62.7193 62.9194 68.7387 71.8905 74.5555 74.6304 75.9688 76.2002 77.6153 83.2938 88.3650 95.0619 98.0160 109.8254 109.9871 110.2012 112.9545 113.7181 145.2674 145.5550 145.6014 146.4122 149.2318 151.8545 153.4524 155.2344 156.9015 160.3915 161.7570 163.1897 163.4969 164.9631 165.6682 167.5067 182.7581 196.0673 196.6501 196.6970 197.3653 203.5178 205.5982 206.5462 208.0644 212.5182 212.8743 216.6019 217.2502 217.7133 219.3300 220.3915 226.6113 227.3192 228.3143 230.5037 230.5123 230.7505 261.0049 261.1369 341.1706 350.4284 352.1051 674.5470 831.7917 832.6899 832.9474 833.1058 834.3273 840.2613 840.5050 2222.4479 7607.0449 43693.2526 electronvolt
chargesum: 2.0000000
charge: 1.350339 0.324803 0.324859
charge: 2.053665 -0.026837 -0.026828
qa: 1.3503 0.3248 0.3249
va: 1.7829 0.8991 0.8990
total: -2401.173528229 hartree
dispersion: -0.000721107 hartree
energy: -2401.174249336286 hartree
dipole: 0.00649 -0.00355 0.00294 -2.17196 1.18779 -0.98418 0.00000 0.00000 0.00000
magnitude: 0.98418 au
magnitude: 2.50159 debye
