program: Orca
programVersion: 5.0.4
elementType: N C C Se F F N C C H H H H H H H H H H H H
charge: 0
multiplicity: 1
keywords: SP DSD-BLYP D3BJ def2-QZVPP def2-QZVPP/C def2/J TightSCF
formula: C4H12F2N2Se
InChI: InChI=1/C4H12F2N2Se/c1-3-7-9(5,6)8-4-2/h7-8H,3-4H2,1-2H3
21 atoms
N  1.09839 0.784634 -0.211051
C  2.17033 0.891295 0.772591
C  2.917255 2.191152 0.526758
Se 0.094124 -0.721866 -0.408911
F  0.314329 -1.037369 1.356441
F  -0.179785 -0.135096 -2.126234
N  -1.603518 -0.200871 -0.058838
C  -1.908145 0.568656 1.144929
C  -3.353038 1.0321 1.074586
H  1.371043 1.105288 -1.13195
H  1.743274 0.904652 1.772493
H  2.878526 0.055655 0.736688
H  2.243686 3.046265 0.579053
H  3.403015 2.200354 -0.450919
H  3.695162 2.32724 1.277262
H  -1.957288 0.252393 -0.894024
H  -1.776638 -0.063408 2.019837
H  -1.248876 1.43585 1.26138
H  -4.03385 0.186064 0.986509
H  -3.61331 1.582288 1.978491
H  -3.526145 1.698729 0.227482
totalener: -2868.49099076 hartree
nucrepener: 888.66673277 hartree
electener: -3757.15772353 hartree
oneelecener: -5753.77090785 hartree
twoeener: 1996.61318432 hartree
kineticenergy: 2865.74373900 hartree
exchangeener: -44.721874314286 hartree
correlationener: -2.155891183653 hartree
xcener: -46.877765497939 hartree
chargesum: 0.0000000
charge: -0.490038 0.100558 -0.177225 1.290546 -0.541180 -0.567385 -0.493415 0.078988 -0.177038 0.173434 0.084248 0.035436 0.073229 0.041532 0.062015 0.191644 0.087516 0.049079 0.076802 0.059467 0.041785
charge: 0.271288 -0.078123 0.225772 0.716336 -0.192692 -0.248500 0.265545 -0.072330 0.225639 -0.241469 -0.062022 -0.067725 -0.061530 -0.065377 -0.059853 -0.236836 -0.062707 -0.068158 -0.060875 -0.060458 -0.065925
qa: -0.4900 0.1006 -0.1772 1.2905 -0.5412 -0.5674 -0.4934 0.0790 -0.1770 0.1734 0.0842 0.0354 0.0732 0.0415 0.0620 0.1916 0.0875 0.0491 0.0768 0.0595 0.0418
va: 2.8729 3.8227 3.8871 3.4193 0.6812 0.6460 2.9047 3.8275 3.8874 1.0336 0.9842 0.9794 1.0021 0.9947 1.0007 1.0183 0.9792 0.9835 1.0012 0.9993 0.9963
total: -2869.637034946 hartree
dispersion: -0.012727975 hartree
energy: -2869.649762920468 hartree
dipole: -1.86635 2.14893 0.28258 22.33628 -21.53725 0.79903 12.76370 -12.46228 0.30142
magnitude: 0.89954 au
magnitude: 2.28644 debye
