program: Orca
programVersion: 5.0.4
elementType: N C C Se N C C H H H H H H H H H H H H
charge: 2
multiplicity: 1
keywords: SP DSD-BLYP D3BJ def2-QZVPP def2-QZVPP/C def2/J TightSCF
formula: C4H12N2Se
InChI: InChI=1/C4H12N2Se/c1-3-5-7-6-4-2/h5-6H,3-4H2,1-2H3
19 atoms
N  -1.361377 -0.910946 -0.180469
C  -2.740227 -0.363549 -0.290327
C  -2.808447 1.139092 -0.214059
Se 0.001677 0.098515 0.007443
N  1.34286 -0.954062 0.076067
C  2.732662 -0.445774 0.239827
C  2.82612 1.054893 0.332179
H  -1.276689 -1.931421 -0.227947
H  -3.127498 -0.746043 -1.240293
H  -3.306644 -0.844359 0.513584
H  -2.290776 1.640697 -1.037435
H  -3.854126 1.433547 -0.309295
H  -2.480147 1.542457 0.748629
H  1.239768 -1.971565 0.007254
H  3.287784 -0.841707 -0.616547
H  3.116679 -0.939383 1.138289
H  3.876786 1.320258 0.454253
H  2.319395 1.46888 1.209286
H  2.50099 1.568215 -0.577834
totalener: -2668.40631479 hartree
nucrepener: 585.36107986 hartree
electener: -3253.76739465 hartree
oneelecener: -4835.47525332 hartree
twoeener: 1581.70785867 hartree
kineticenergy: 2665.95515321 hartree
exchangeener: -38.248594480044 hartree
correlationener: -1.746180649970 hartree
xcener: -39.994775130014 hartree
chargesum: 2.0000000
charge: -0.291586 0.053409 -0.141219 1.090139 -0.291636 0.054977 -0.140009 0.257154 0.149931 0.150316 0.062796 0.149768 0.064221 0.257204 0.148744 0.149654 0.149008 0.063295 0.063833
charge: 0.341279 0.034193 0.243089 1.315011 0.341251 0.035164 0.242880 -0.133288 -0.015896 -0.016009 -0.049799 -0.011627 -0.049451 -0.133485 -0.016137 -0.016184 -0.011590 -0.049850 -0.049549
qa: -0.2916 0.0534 -0.1412 1.0901 -0.2916 0.0550 -0.1400 0.2572 0.1499 0.1503 0.0628 0.1498 0.0642 0.2572 0.1487 0.1497 0.1490 0.0633 0.0638
va: 3.3802 3.7291 3.9094 3.3189 3.3779 3.7296 3.9099 0.9689 0.9686 0.9684 0.9977 0.9952 0.9980 0.9692 0.9689 0.9689 0.9953 0.9976 0.9985
total: -2669.266945823 hartree
dispersion: -0.011668129 hartree
energy: -2669.278613952614 hartree
dipole: -0.01217 0.00275 -0.00942 0.57077 -1.82879 -1.25802 -0.01903 -0.05518 -0.07421
magnitude: 1.26024 au
magnitude: 3.20327 debye
