program: Orca
programVersion: 5.0.4
elementType: N C C Se F N C C C C H H H H H H H H H H H H H H H H
charge: 1
multiplicity: 1
keywords: Opt RIJCOSX PBEh-3c
formula: C6H16FN2Se
InChI: InChI=1/C6H16FN2Se/c1-4-8-10(7)9(5-2)6-3/h8H,4-6H2,1-3H3
26 atoms
N  1.585153 -0.164851 -0.632386
C  3.014458 0.205759 -0.738033
C  3.847465 -0.119878 0.485563
Se 0.533242 0.873439 0.300237
F  0.67154 0.183206 1.897095
N  -1.034431 0.368169 -0.225895
C  -1.338471 -0.992989 -0.689625
C  -1.357056 -2.04217 0.408129
C  -2.172982 1.220999 0.192346
C  -2.879637 1.836462 -0.998185
H  1.41816 -1.165039 -0.559718
H  3.074459 1.265355 -0.99324
H  3.376337 -0.330314 -1.615079
H  4.893527 0.106863 0.284503
H  3.552146 0.462064 1.359036
H  3.787141 -1.176402 0.746109
H  -2.31975 -0.922788 -1.159279
H  -0.652942 -1.254891 -1.49764
H  -2.042902 -1.772948 1.2104
H  -1.691411 -2.992476 -0.005401
H  -0.376997 -2.210083 0.855018
H  -2.847986 0.605241 0.789791
H  -1.825668 2.01125 0.863897
H  -3.729021 2.423487 -0.651267
H  -2.217764 2.498091 -1.554489
H  -3.266509 1.084546 -1.684987
totalener: -2846.86726008 hartree
nucrepener: 990.04857461 hartree
electener: -3836.91583469 hartree
oneelecener: -5900.21431553 hartree
twoeener: 2063.29848085 hartree
kineticenergy: 2841.70291787 hartree
exchangeener: -81.754009349460 hartree
correlationener: -5.365427819171 hartree
xcener: -87.119437168632 hartree
dispersion: -0.014545969 hartree
dispersion: -0.014548565 hartree
energy: -12404.0907 -1607.1157 -1442.3136 -1442.2644 -1442.2302 -687.4747 -404.5294 -404.3914 -289.6029 -289.5753 -289.5429 -287.7586 -287.5630 -287.5376 -229.8773 -172.4133 -172.3588 -172.1994 -70.5466 -70.5218 -70.3568 -70.3251 -70.2657 -40.2002 -34.1091 -32.5255 -28.1086 -27.8088 -26.6435 -25.2821 -23.9049 -23.2863 -22.5363 -21.1177 -20.5499 -19.8486 -18.8828 -18.5238 -18.3941 -17.9627 -17.6838 -17.5046 -17.1417 -17.0326 -16.3568 -16.1174 -15.6857 -15.5358 -15.3627 -15.1145 -14.9690 -14.8454 -13.9144 -12.9903 -4.9875 -4.3106 -2.7942 -1.1983 -0.1286 0.4943 0.5876 0.8640 0.9221 1.2366 1.3799 1.5442 1.6306 1.8083 1.9326 2.1920 2.2885 2.4425 2.6724 2.8292 2.8473 3.2660 3.5734 3.9686 4.0058 4.9730 6.6911 7.5107 7.8890 8.8068 9.2141 9.4485 9.7773 10.0343 10.2501 10.8186 10.9667 11.3163 11.4567 11.6946 12.3899 12.7796 13.1126 13.6360 14.0564 14.6900 14.9360 15.8043 17.4072 17.5255 18.3547 18.9763 20.4125 21.9097 22.4138 22.5350 23.0136 23.4303 23.4837 23.7562 24.0335 24.2788 24.5059 24.5737 24.8321 24.9971 25.1759 25.3149 25.4792 25.6856 26.4720 26.6197 26.8683 26.9285 27.3886 28.1087 29.8821 30.4387 30.7376 30.9235 31.5034 31.8302 33.7317 34.3026 34.4747 35.6243 36.4104 37.1247 37.9526 38.5330 39.8143 41.2528 41.3589 43.2851 44.1550 44.8490 45.4627 46.2788 47.1864 47.6815 49.8644 49.9700 50.2685 50.5862 50.7414 51.7997 52.1949 52.4325 54.1734 55.2149 55.8403 56.8356 58.0020 58.0755 59.4471 60.7379 61.2135 61.2641 61.8124 62.0262 62.8015 63.3383 63.7291 64.7738 67.5286 67.9804 68.2972 69.0202 70.0043 70.4936 71.5338 84.6455 85.1181 87.0587 88.4146 89.3612 366.5586 367.1050 368.0624 374.9845 375.6864 377.5532 515.8529 519.0577 884.0133 electronvolt
chargesum: 1.0000000
charge: -0.737785 -0.331538 -0.651222 1.347691 -0.419575 -0.565189 -0.341752 -0.647600 -0.332474 -0.630065 0.414479 0.267172 0.292343 0.272174 0.235866 0.241759 0.288518 0.266738 0.253748 0.270975 0.219164 0.277935 0.258550 0.267425 0.241273 0.241390
charge: -0.375247 -0.164006 -0.377642 1.065368 -0.327201 -0.247152 -0.162656 -0.373206 -0.151394 -0.364532 0.275792 0.144490 0.157408 0.159803 0.137892 0.142401 0.157583 0.140189 0.146957 0.158223 0.129001 0.146998 0.140847 0.157506 0.142072 0.140505
qa: -0.7378 -0.3315 -0.6512 1.3477 -0.4196 -0.5652 -0.3418 -0.6476 -0.3325 -0.6301 0.4145 0.2672 0.2923 0.2722 0.2359 0.2418 0.2885 0.2667 0.2537 0.2710 0.2192 0.2779 0.2585 0.2674 0.2413 0.2414
va: 2.8892 3.6389 3.6779 3.3273 0.9446 2.9815 3.6297 3.6814 3.6350 3.6734 0.8040 0.8876 0.8770 0.8932 0.9093 0.9050 0.8840 0.8903 0.9016 0.8924 0.9176 0.8805 0.8935 0.8949 0.9062 0.9076
dispersion: -0.014545404 hartree
energy: -2846.830074592314 hartree
dipole: -7.82807 7.74876 -0.07931 -11.77484 11.49380 -0.28104 -8.73783 7.94211 -0.79572
magnitude: 0.84761 au
magnitude: 2.15446 debye
