program: Orca
programVersion: 5.0.4
elementType: N C C Se F F N C C C C H H H H H H H H H H H H H H H H
charge: 0
multiplicity: 1
keywords: Opt RIJCOSX PBEh-3c
formula: C6H16F2N2Se
InChI: InChI=1/C6H16F2N2Se/c1-4-9-11(7,8)10(5-2)6-3/h9H,4-6H2,1-3H3
27 atoms
N  1.775328 0.352787 -0.513563
C  2.938081 0.431357 0.358738
C  3.922579 -0.723618 0.25622
Se 0.565574 -0.991057 -0.400864
F  0.477077 -0.901762 -2.224692
F  0.792579 -0.934307 1.41461
N  -0.951427 0.005827 -0.327892
C  -2.156837 -0.753888 -0.637464
C  -2.78293 -1.51256 0.525419
C  -1.052068 1.020639 0.712877
C  -2.071431 2.086097 0.337026
H  1.998766 0.478177 -1.493032
H  2.609199 0.562778 1.386012
H  3.434476 1.363409 0.078658
H  3.476655 -1.657828 0.599274
H  4.266496 -0.866418 -0.769215
H  4.799494 -0.535658 0.876503
H  -1.933881 -1.440495 -1.456812
H  -2.884288 -0.055229 -1.057418
H  -3.113876 -0.844397 1.320826
H  -3.657773 -2.066326 0.18344
H  -2.087153 -2.22805 0.9658
H  -1.300893 0.600863 1.693177
H  -0.079505 1.501113 0.810243
H  -1.856237 2.501248 -0.646934
H  -2.032813 2.897242 1.064537
H  -3.094991 1.710056 0.334025
totalener: -2946.77983673 hartree
nucrepener: 1174.68346509 hartree
electener: -4121.46330182 hartree
oneelecener: -6429.69852167 hartree
twoeener: 2308.23521984 hartree
kineticenergy: 2941.05762384 hartree
exchangeener: -87.572984039846 hartree
correlationener: -5.843628973277 hartree
xcener: -93.416613013123 hartree
dispersion: -0.015656810 hartree
dispersion: -0.015650031 hartree
dispersion: -0.015611788 hartree
dispersion: -0.015647143 hartree
dispersion: -0.015655854 hartree
dispersion: -0.015659788 hartree
energy: -12398.5598 -1601.4964 -1436.7042 -1436.6381 -1436.6078 -681.0706 -680.8777 -398.8787 -398.7856 -285.0394 -284.9947 -284.7488 -283.8405 -283.7874 -283.7579 -224.2350 -166.7908 -166.6807 -166.5448 -64.9273 -64.8370 -64.7158 -64.6600 -64.6026 -33.8294 -33.4748 -28.2309 -27.3578 -23.2724 -23.2675 -22.2624 -20.7329 -19.6424 -18.8522 -17.3664 -15.9829 -15.2178 -15.1604 -14.6766 -14.1996 -13.6879 -13.2023 -13.0341 -12.9977 -12.8489 -12.1997 -11.9564 -11.8461 -11.6705 -11.6071 -11.3757 -11.2451 -11.1042 -10.8887 -10.8234 -10.4430 -9.5890 -8.2689 -7.5282 0.6683 2.3085 2.3978 3.5274 3.9463 4.8497 4.9452 4.9712 5.1435 5.2657 5.6158 5.6764 5.7470 6.0083 6.0835 6.1842 6.2899 6.5098 6.5883 6.6110 6.9508 7.3931 7.6930 7.9034 8.4993 10.9866 11.8765 12.6352 12.8315 13.1336 13.5318 13.7692 13.9509 14.4751 14.5762 14.7331 14.9803 15.8156 16.2109 16.3726 16.7832 17.3097 17.8339 18.3301 18.5594 18.8590 20.1758 21.0471 21.8632 22.7234 23.4920 24.5862 25.3382 26.2971 26.6529 26.8916 27.0721 27.3287 27.5964 27.8190 27.9614 28.0946 28.2525 28.5429 28.6779 28.7759 28.9364 29.2209 29.7079 29.9666 30.3398 30.4774 30.8919 31.3271 31.6258 32.9460 33.9694 35.2650 35.4719 35.8244 35.8802 36.2300 36.4189 36.9208 37.0366 37.1884 38.2019 39.2497 39.6823 40.3038 40.5958 40.8601 41.4091 42.3811 43.6933 44.4707 44.6239 45.1918 45.4179 46.1605 47.6344 48.4078 49.0958 49.5918 49.9975 51.0208 53.6170 53.7290 54.0324 55.0501 55.1571 55.4302 56.3614 56.5606 57.0841 57.5420 59.4278 60.0444 61.2430 62.0774 62.1926 63.3872 64.1497 64.5234 65.2499 65.9249 66.1175 66.3153 67.1880 68.1856 68.6395 69.3131 70.5302 71.5606 73.1031 74.9896 75.4119 76.0471 77.0085 81.2078 92.4389 93.0919 94.8154 96.6111 100.0270 370.9516 371.4665 373.1671 379.9715 380.0590 381.0348 522.0175 526.4681 887.1582 896.1534 electronvolt
chargesum: 0.0000000
charge: -0.734512 -0.294405 -0.658022 1.378547 -0.520849 -0.510183 -0.561737 -0.320921 -0.651860 -0.278088 -0.664534 0.372616 0.254160 0.225590 0.231049 0.212718 0.222712 0.249951 0.239106 0.220201 0.222532 0.227427 0.214681 0.251849 0.233306 0.225974 0.212692
charge: -0.398779 -0.177965 -0.384350 0.995595 -0.440423 -0.429408 -0.281942 -0.170261 -0.381265 -0.166814 -0.368982 0.254937 0.137373 0.127146 0.132532 0.125254 0.133060 0.134561 0.128522 0.127875 0.132492 0.131052 0.111119 0.137738 0.134980 0.133246 0.122709
qa: -0.7345 -0.2944 -0.6580 1.3785 -0.5208 -0.5102 -0.5617 -0.3209 -0.6519 -0.2781 -0.6645 0.3726 0.2542 0.2256 0.2310 0.2127 0.2227 0.2500 0.2391 0.2202 0.2225 0.2274 0.2147 0.2518 0.2333 0.2260 0.2127
va: 2.8501 3.7642 3.7152 3.4393 0.8154 0.8403 2.9161 3.7343 3.7007 3.7289 3.7242 0.8421 0.9029 0.9013 0.9116 0.9136 0.9121 0.9049 0.8966 0.9126 0.9104 0.9120 0.9001 0.9046 0.9082 0.9103 0.9136
dispersion: -0.015660318 hartree
energy: -2946.730205778278 hartree
dipole: -9.15233 9.21846 0.06614 14.93105 -14.58552 0.34552 8.96648 -8.76626 0.20022
magnitude: 0.40478 au
magnitude: 1.02888 debye
