program: Orca
programVersion: 5.0.4
elementType: N C C Se F F N C C C C H H H H H H H H H H H H H H H H
charge: 0
multiplicity: 1
keywords: SP DSD-BLYP D3BJ def2-QZVPP def2-QZVPP/C def2/J TightSCF
formula: C6H16F2N2Se
InChI: InChI=1/C6H16F2N2Se/c1-4-9-11(7,8)10(5-2)6-3/h9H,4-6H2,1-3H3
27 atoms
N  1.499094 0.779938 -0.358057
C  2.661846 0.858509 0.514244
C  3.646345 -0.296466 0.411727
Se 0.289339 -0.563905 -0.245358
F  0.200842 -0.47461 -2.069186
F  0.516345 -0.507155 1.570116
N  -1.227662 0.432978 -0.172385
C  -2.433072 -0.326736 -0.481957
C  -3.059164 -1.085408 0.680926
C  -1.328303 1.44779 0.868383
C  -2.347665 2.513249 0.492532
H  1.722531 0.905328 -1.337525
H  2.332964 0.989929 1.541519
H  3.158241 1.790561 0.234164
H  3.20042 -1.230676 0.754781
H  3.990261 -0.439266 -0.613708
H  4.52326 -0.108506 1.03201
H  -2.210116 -1.013343 -1.301306
H  -3.160523 0.371923 -0.901911
H  -3.390111 -0.417245 1.476332
H  -3.934008 -1.639174 0.338947
H  -2.363387 -1.800899 1.121307
H  -1.577128 1.028015 1.848683
H  -0.35574 1.928264 0.96575
H  -2.132471 2.9284 -0.491427
H  -2.309048 3.324394 1.220044
H  -3.371226 2.137208 0.489532
totalener: -2946.84502566 hartree
nucrepener: 1173.00703921 hartree
electener: -4119.85206488 hartree
oneelecener: -6426.28145553 hartree
twoeener: 2306.42939066 hartree
kineticenergy: 2943.91345056 hartree
exchangeener: -48.386384812921 hartree
correlationener: -2.436924791517 hartree
xcener: -50.823309604437 hartree
chargesum: -0.0000000
charge: -0.512323 0.100195 -0.185209 1.241921 -0.565513 -0.561294 -0.401689 0.038589 -0.163963 0.081595 -0.189597 0.189104 0.083063 0.053313 0.066043 0.054143 0.052575 0.084749 0.061643 0.045840 0.055325 0.053878 0.057683 0.082542 0.073173 0.058718 0.045498
charge: 0.293079 -0.076524 0.218133 0.741037 -0.241131 -0.224369 0.143545 -0.082501 0.223972 -0.072172 0.229365 -0.236470 -0.062793 -0.054355 -0.067207 -0.066649 -0.061614 -0.055187 -0.050117 -0.064776 -0.061710 -0.064713 -0.062262 -0.056759 -0.059251 -0.060755 -0.067818
qa: -0.5123 0.1002 -0.1852 1.2419 -0.5655 -0.5613 -0.4017 0.0386 -0.1640 0.0816 -0.1896 0.1891 0.0831 0.0533 0.0660 0.0541 0.0526 0.0847 0.0616 0.0458 0.0553 0.0539 0.0577 0.0825 0.0732 0.0587 0.0455
va: 2.8986 3.8280 3.8709 3.4628 0.6476 0.6534 2.7813 3.8640 3.8757 3.7939 3.8761 1.0252 0.9978 0.9842 1.0024 1.0030 1.0066 0.9984 0.9843 1.0049 1.0011 1.0097 0.9991 0.9850 1.0077 0.9997 0.9903
total: -2948.177852536 hartree
dispersion: -0.018271487 hartree
energy: -2948.196124023615 hartree
dipole: -9.15233 9.16042 0.00809 14.93105 -14.53423 0.39681 8.96648 -8.70419 0.26229
magnitude: 0.47574 au
magnitude: 1.20922 debye
