program: Orca
programVersion: 5.0.4
elementType: N C C Se N C C C C O H H H H H H H H H H H H H H H H
charge: 0
multiplicity: 1
keywords: Freq RIJCOSX PBEh-3c
frequency: 0.00 0.00 0.00 0.00 0.00 0.00 27.55 41.95 57.86 88.93 97.79 131.06 183.80 213.17 226.14 254.73 284.66 286.59 326.15 336.92 360.78 375.39 465.06 514.46 579.96 608.14 751.78 807.05 812.02 848.71 914.61 933.87 962.75 992.63 1059.55 1111.22 1122.02 1132.81 1155.65 1164.11 1178.30 1247.69 1259.17 1329.41 1369.08 1406.78 1410.37 1420.51 1450.74 1462.36 1467.66 1470.58 1477.36 1535.95 1539.60 1543.88 1546.22 1549.07 1549.79 1554.23 1556.00 1560.41 3075.63 3107.92 3113.74 3118.01 3118.88 3119.85 3148.48 3163.75 3174.32 3198.01 3198.72 3199.17 3204.76 3214.14 3216.02 3571.66
frequency: 27.55 41.95 57.86 88.93 97.79 131.06 183.80 213.17 226.14 254.73 284.66 286.59 326.15 336.92 360.78 375.39 465.06 514.46 579.96 608.14 751.78 807.05 812.02 848.71 914.61 933.87 962.75 992.63 1059.55 1111.22 1122.02 1132.81 1155.65 1164.11 1178.30 1247.69 1259.17 1329.41 1369.08 1406.78 1410.37 1420.51 1450.74 1462.36 1467.66 1470.58 1477.36 1535.95 1539.60 1543.88 1546.22 1549.07 1549.79 1554.23 1556.00 1560.41 3075.63 3107.92 3113.74 3118.01 3118.88 3119.85 3148.48 3163.75 3174.32 3198.01 3198.72 3199.17 3204.76 3214.14 3216.02 3571.66
formula: C6H16N2OSe
InChI: InChI=1/C6H16N2OSe/c1-4-7-10(9)8(5-2)6-3/h7H,4-6H2,1-3H3
26 atoms
N  1.602967 -0.275942 -0.548517
C  2.972371 -0.761379 -0.447476
C  3.948974 0.163358 0.26776
Se 0.60303 -0.331653 0.9813
N  -0.919827 0.159588 0.053967
C  -1.85537 1.040828 0.738408
C  -2.347636 2.145482 -0.185139
C  -1.504263 -0.887065 -0.769735
C  -2.208752 -2.016436 -0.023795
O  0.898885 0.967283 1.891758
H  1.535622 0.637421 -0.990921
H  3.322014 -0.957276 -1.4642
H  2.951251 -1.737853 0.045065
H  4.955326 -0.256729 0.256104
H  3.992465 1.138738 -0.219055
H  3.662526 0.331499 1.30549
H  -2.710281 0.484192 1.141401
H  -1.3553 1.50203 1.590271
H  -2.862264 1.755008 -1.063955
H  -3.050932 2.791928 0.341685
H  -1.51338 2.757238 -0.525489
H  -2.212538 -0.40405 -1.448687
H  -0.722402 -1.29806 -1.411422
H  -3.015029 -1.64966 0.611727
H  -1.518524 -2.579531 0.605988
H  -2.649132 -2.718859 -0.732434
totalener: -2822.50421830 hartree
nucrepener: 963.53809511 hartree
electener: -3786.04231342 hartree
oneelecener: -5832.29413173 hartree
twoeener: 2046.25181831 hartree
kineticenergy: 2817.49447508 hartree
exchangeener: -80.875752697709 hartree
correlationener: -5.350193888237 hartree
xcener: -86.225946585946 hartree
energy: -12397.5917 -1600.6495 -1435.8265 -1435.8145 -1435.7699 -529.1924 -398.5859 -398.5202 -285.0604 -284.9169 -284.6877 -283.8322 -283.6952 -283.6047 -223.4519 -165.9723 -165.9604 -165.7890 -64.1153 -64.0942 -63.9584 -63.9126 -63.8699 -29.6104 -27.4395 -27.0210 -23.2413 -22.7474 -21.9477 -19.9596 -19.5047 -18.6853 -17.2433 -15.6575 -14.7795 -14.5474 -14.1423 -13.3378 -13.1968 -13.0128 -12.9216 -12.4691 -11.9662 -11.6553 -11.5508 -11.4409 -11.1500 -10.9195 -10.8368 -10.4158 -9.1671 -8.4773 -7.9337 -7.1681 0.9053 1.8566 3.0476 3.6210 4.0308 4.5809 4.8281 5.0171 5.0968 5.3661 5.6109 5.7541 5.8342 5.9232 6.0347 6.1339 6.4352 6.4708 6.6513 6.9715 7.0191 7.4105 7.8503 8.0871 8.4234 10.0658 11.7592 12.3813 12.8355 13.4438 13.7525 14.1453 14.3048 14.6215 14.7108 15.1067 15.4235 15.5548 16.0415 16.3315 17.3477 17.4456 17.6538 18.0039 18.4930 18.7418 20.3108 21.1196 21.3575 22.3616 23.3124 24.0886 24.6142 26.2894 26.6935 27.0409 27.2507 27.5897 27.6939 27.7810 28.0018 28.1806 28.5012 28.7112 28.9804 29.0480 29.1596 29.1835 29.6949 30.0694 30.4241 30.6224 30.8739 31.1777 31.9262 32.8688 33.4805 34.4518 34.7436 36.0206 38.0521 39.9416 40.2516 40.7747 41.8280 43.4903 44.3603 44.8219 45.4519 47.0112 48.4389 49.3330 49.8456 51.8847 52.0998 52.1729 52.9793 53.6519 54.1402 54.2714 54.7042 55.2565 55.3610 56.2541 57.2412 57.4866 57.8186 59.1016 59.2969 60.1827 60.6030 61.4456 61.9317 62.6366 63.8458 64.9576 65.5233 65.6724 65.8828 66.1546 67.0857 68.0343 68.3025 69.2477 70.8241 71.9889 72.9888 74.5810 74.9583 75.5311 77.5122 90.2010 90.5651 93.2803 94.8925 97.3132 370.9377 371.3704 372.8522 379.4706 379.7517 382.1560 522.1785 524.5034 696.6087 electronvolt
chargesum: -0.0000000
charge: -0.726889 -0.296607 -0.647820 1.092673 -0.573372 -0.292549 -0.627877 -0.303738 -0.653157 -0.690763 0.354111 0.231063 0.220965 0.213107 0.213716 0.244275 0.194649 0.266640 0.206109 0.214267 0.226282 0.227266 0.246758 0.220004 0.218492 0.222395
charge: -0.434379 -0.179520 -0.384608 0.828901 -0.310817 -0.169919 -0.366283 -0.173327 -0.383644 -0.578243 0.242308 0.124495 0.122228 0.128265 0.127083 0.139044 0.102298 0.144979 0.119705 0.128012 0.132013 0.125434 0.131741 0.126421 0.125595 0.132218
qa: -0.7269 -0.2966 -0.6478 1.0927 -0.5734 -0.2925 -0.6279 -0.3037 -0.6532 -0.6908 0.3541 0.2311 0.2210 0.2131 0.2137 0.2443 0.1946 0.2666 0.2061 0.2143 0.2263 0.2273 0.2468 0.2200 0.2185 0.2224
va: 2.8150 3.7696 3.7062 3.5466 2.8700 3.6919 3.7255 3.7312 3.7097 1.8660 0.8482 0.8989 0.9062 0.9127 0.9152 0.9107 0.9076 0.9112 0.9172 0.9137 0.9125 0.9042 0.9069 0.9137 0.9138 0.9113
dispersion: -0.014675803 hartree
energy: -2822.467158053835 hartree
dipole: -8.61737 8.42241 -0.19495 3.60149 -4.30291 -0.70142 -14.01681 13.12346 -0.89335
magnitude: 1.15242 au
magnitude: 2.92921 debye
temp: 298.15 k
press: 1.00 atm
zeropoint: 0.23250541 hartree
thermalvibcorrection: 0.01074579 hartree
thermalrotcorrection: 0.00141627 hartree
thermaltrasncorrection: 0.00141627 hartree
thermaltotal: -2822.22107431 hartree
thermalcorr: 0.01357834 hartree
nonthermalcorr: 0.23250541 hartree
totalcorr: 0.24608374 hartree
thermalcorrenthalpy: 0.00094421 hartree
totalenthalpy: -2822.22013010 hartree
vibrat: 0.01928796 hartree
rotat: 0.01461991 hartree
transl: 0.01992988 hartree
total: 0.05383774 hartree
totalentropycorr: -0.05383774 hartree
gibbsenthalpy: -2822.27396784 hartree
gibbsminuselec: 0.19319021 hartree
