program: Orca
programVersion: 5.0.4
elementType: N C C Se N C C C C O H H H H H H H H H H H H H H H H
charge: 0
multiplicity: 1
keywords: Opt RIJCOSX PBEh-3c
formula: C6H16N2OSe
InChI: InChI=1/C6H16N2OSe/c1-4-7-10(9)8(5-2)6-3/h7H,4-6H2,1-3H3
26 atoms
N  1.602967 -0.275942 -0.548517
C  2.972371 -0.761379 -0.447476
C  3.948974 0.163358 0.26776
Se 0.60303 -0.331653 0.9813
N  -0.919827 0.159588 0.053967
C  -1.85537 1.040828 0.738408
C  -2.347636 2.145482 -0.185139
C  -1.504263 -0.887065 -0.769735
C  -2.208752 -2.016436 -0.023795
O  0.898885 0.967283 1.891758
H  1.535622 0.637421 -0.990921
H  3.322014 -0.957276 -1.4642
H  2.951251 -1.737853 0.045065
H  4.955326 -0.256729 0.256104
H  3.992465 1.138738 -0.219055
H  3.662526 0.331499 1.30549
H  -2.710281 0.484192 1.141401
H  -1.3553 1.50203 1.590271
H  -2.862264 1.755008 -1.063955
H  -3.050932 2.791928 0.341685
H  -1.51338 2.757238 -0.525489
H  -2.212538 -0.40405 -1.448687
H  -0.722402 -1.29806 -1.411422
H  -3.015029 -1.64966 0.611727
H  -1.518524 -2.579531 0.605988
H  -2.649132 -2.718859 -0.732434
totalener: -2822.50420402 hartree
nucrepener: 963.52176460 hartree
electener: -3786.02596862 hartree
oneelecener: -5832.26193709 hartree
twoeener: 2046.23596847 hartree
kineticenergy: 2817.49453240 hartree
exchangeener: -80.875772790305 hartree
correlationener: -5.350192986987 hartree
xcener: -86.225965777292 hartree
dispersion: -0.014675551 hartree
energy: -12397.5918 -1600.6496 -1435.8267 -1435.8146 -1435.7700 -529.1923 -398.5856 -398.5201 -285.0604 -284.9168 -284.6877 -283.8321 -283.6952 -283.6047 -223.4520 -165.9724 -165.9605 -165.7891 -64.1153 -64.0943 -63.9585 -63.9127 -63.8700 -29.6104 -27.4394 -27.0209 -23.2413 -22.7474 -21.9477 -19.9596 -19.5047 -18.6853 -17.2432 -15.6575 -14.7794 -14.5474 -14.1423 -13.3377 -13.1968 -13.0128 -12.9216 -12.4691 -11.9662 -11.6553 -11.5508 -11.4409 -11.1500 -10.9195 -10.8368 -10.4158 -9.1671 -8.4773 -7.9336 -7.1680 0.9053 1.8566 3.0476 3.6210 4.0308 4.5809 4.8281 5.0171 5.0968 5.3661 5.6109 5.7542 5.8342 5.9232 6.0347 6.1339 6.4352 6.4708 6.6514 6.9715 7.0191 7.4105 7.8503 8.0871 8.4234 10.0658 11.7592 12.3814 12.8355 13.4438 13.7525 14.1453 14.3048 14.6215 14.7108 15.1068 15.4235 15.5548 16.0416 16.3315 17.3478 17.4457 17.6538 18.0039 18.4930 18.7418 20.3108 21.1196 21.3575 22.3616 23.3124 24.0886 24.6143 26.2894 26.6935 27.0409 27.2508 27.5897 27.6939 27.7810 28.0018 28.1806 28.5012 28.7112 28.9804 29.0480 29.1596 29.1835 29.6949 30.0695 30.4241 30.6224 30.8739 31.1777 31.9262 32.8689 33.4806 34.4519 34.7436 36.0207 38.0521 39.9416 40.2517 40.7747 41.8280 43.4903 44.3603 44.8220 45.4520 47.0112 48.4389 49.3331 49.8457 51.8847 52.0998 52.1730 52.9793 53.6520 54.1402 54.2714 54.7043 55.2565 55.3611 56.2541 57.2412 57.4866 57.8187 59.1016 59.2969 60.1827 60.6031 61.4456 61.9317 62.6367 63.8458 64.9577 65.5233 65.6724 65.8829 66.1546 67.0857 68.0343 68.3025 69.2478 70.8241 71.9889 72.9888 74.5810 74.9583 75.5312 77.5123 90.2010 90.5651 93.2803 94.8925 97.3132 370.9377 371.3704 372.8522 379.4707 379.7517 382.1560 522.1786 524.5037 696.6088 electronvolt
chargesum: -0.0000000
charge: -0.726893 -0.296604 -0.647818 1.092680 -0.573385 -0.292546 -0.627877 -0.303740 -0.653157 -0.690765 0.354112 0.231062 0.220965 0.213106 0.213715 0.244275 0.194649 0.266641 0.206109 0.214268 0.226282 0.227267 0.246760 0.220005 0.218493 0.222396
charge: -0.434382 -0.179518 -0.384607 0.828906 -0.310827 -0.169916 -0.366283 -0.173329 -0.383645 -0.578244 0.242309 0.124495 0.122228 0.128265 0.127083 0.139044 0.102298 0.144980 0.119705 0.128012 0.132013 0.125436 0.131742 0.126422 0.125595 0.132219
qa: -0.7269 -0.2966 -0.6478 1.0927 -0.5734 -0.2925 -0.6279 -0.3037 -0.6532 -0.6908 0.3541 0.2311 0.2210 0.2131 0.2137 0.2443 0.1946 0.2666 0.2061 0.2143 0.2263 0.2273 0.2468 0.2200 0.2185 0.2224
va: 2.8150 3.7696 3.7062 3.5466 2.8700 3.6919 3.7255 3.7312 3.7097 1.8660 0.8482 0.8989 0.9062 0.9127 0.9152 0.9107 0.9076 0.9112 0.9172 0.9137 0.9125 0.9042 0.9069 0.9137 0.9138 0.9113
dispersion: -0.014675803 hartree
energy: -2822.467157997271 hartree
dipole: -8.61737 8.42243 -0.19494 3.60149 -4.30291 -0.70141 -14.01681 13.12346 -0.89334
magnitude: 1.15241 au
magnitude: 2.92919 debye
