program: Orca
programVersion: 5.0.4
elementType: N C C Se N C C C C H H H H H H H H H H H H H H H H
charge: 2
multiplicity: 1
keywords: SP DSD-BLYP D3BJ def2-QZVPP def2-QZVPP/C def2/J TightSCF
formula: C6H16N2Se
InChI: InChI=1/C6H16N2Se/c1-4-7-9-8(5-2)6-3/h7H,4-6H2,1-3H3
25 atoms
N  1.289049 -0.990084 -0.061998
C  2.771486 -0.919268 0.039514
C  3.307724 0.477535 0.227308
Se 0.308256 0.412239 0.010044
N  -1.285195 -0.123438 -0.307915
C  -2.367127 0.898233 -0.26858
C  -1.935151 2.30463 0.064864
C  -1.684095 -1.525576 -0.54742
C  -1.846739 -2.314168 0.750612
H  0.88561 -1.920202 -0.183716
H  3.041614 -1.572345 0.873429
H  3.150085 -1.377459 -0.878394
H  2.991176 0.941825 1.16518
H  4.394511 0.41543 0.284741
H  3.099205 1.141618 -0.61678
H  -2.835787 0.852703 -1.256849
H  -3.096425 0.521687 0.455468
H  -1.268247 2.750276 -0.678328
H  -2.82925 2.929463 0.057388
H  -1.516176 2.41273 1.069455
H  -2.633403 -1.470296 -1.081138
H  -0.973625 -1.988636 -1.238663
H  -2.158561 -3.325265 0.490318
H  -0.930675 -2.393441 1.335697
H  -2.622093 -1.885325 1.382546
totalener: -2746.79863781 hartree
nucrepener: 822.99067707 hartree
electener: -3569.78931489 hartree
oneelecener: -5410.93435909 hartree
twoeener: 1841.14504420 hartree
kineticenergy: 2744.14431924 hartree
exchangeener: -41.912232556129 hartree
correlationener: -2.026568149598 hartree
xcener: -43.938800705727 hartree
chargesum: 2.0000000
charge: -0.335329 0.060407 -0.141501 0.995130 -0.220072 0.035409 -0.152943 0.058864 -0.122524 0.255499 0.136251 0.137421 0.063785 0.141699 0.059926 0.139473 0.136062 0.069064 0.140899 0.070250 0.142886 0.071748 0.133307 0.028436 0.095856
charge: 0.331497 0.028113 0.239860 1.290289 0.186805 0.021843 0.240544 0.026010 0.276763 -0.156398 -0.021916 -0.021664 -0.051792 -0.015309 -0.051773 -0.014033 -0.014913 -0.049926 -0.013060 -0.049977 -0.014325 -0.039314 -0.024166 -0.061443 -0.041713
qa: -0.3353 0.0604 -0.1415 0.9951 -0.2201 0.0354 -0.1529 0.0589 -0.1225 0.2555 0.1363 0.1374 0.0638 0.1417 0.0599 0.1395 0.1361 0.0691 0.1409 0.0702 0.1429 0.0717 0.1333 0.0284 0.0959
va: 3.3461 3.7416 3.9117 3.3307 3.3634 3.7662 3.9102 3.7806 3.8771 0.9778 0.9705 0.9705 0.9976 0.9976 0.9974 0.9637 0.9658 0.9971 0.9969 0.9980 0.9815 0.9871 0.9974 1.0083 1.0074
total: -2747.847581582 hartree
dispersion: -0.016541434 hartree
energy: -2747.864123016322 hartree
dipole: -6.26900 6.03986 -0.22914 -7.96894 7.20209 -0.76685 1.00201 -1.22116 -0.21915
magnitude: 0.82981 au
magnitude: 2.10921 debye
