program: Orca
programVersion: 5.0.4
elementType: C C N C C Se N C C C C H H H H H H H H H H H H H H H H H H H H
charge: 2
multiplicity: 1
keywords: Opt RIJCOSX PBEh-3c
formula: C8H20N2Se
InChI: InChI=1/C8H20N2Se/c1-5-9(6-2)11-10(7-3)8-4/h5-8H2,1-4H3
31 atoms
C  1.369113 0.093757 2.39741
C  1.342907 1.099876 1.257818
N  1.347163 0.446826 -0.071373
C  2.566929 0.668444 -0.904032
C  2.659405 -0.115159 -2.191668
Se 0.175616 -0.622609 -0.738078
N  -1.333611 -0.459887 0.069976
C  -2.311459 -1.565282 -0.161279
C  -1.89394 -2.647805 -1.128044
C  -1.825271 0.680546 0.876627
C  -1.953188 1.95389 0.055607
H  1.430733 0.6462 3.334895
H  0.475339 -0.528358 2.449967
H  2.242943 -0.552977 2.341425
H  0.502388 1.792034 1.326484
H  2.240628 1.71728 1.270267
H  3.407281 0.434154 -0.245059
H  2.592237 1.745119 -1.098196
H  2.70678 -1.196773 -2.048736
H  3.601877 0.15948 -2.666502
H  1.885645 0.137639 -2.922419
H  -3.224167 -1.069895 -0.502803
H  -2.515104 -1.982457 0.829721
H  -2.71407 -3.364709 -1.181105
H  -1.027605 -3.228064 -0.797556
H  -1.74589 -2.293877 -2.150473
H  -1.196696 0.808448 1.757966
H  -2.799255 0.363703 1.248663
H  -0.999898 2.329221 -0.318037
H  -2.631012 1.822226 -0.786211
H  -2.375819 2.728911 0.694943
totalener: -2825.22857613 hartree
nucrepener: 1094.37527165 hartree
electener: -3919.60384779 hartree
oneelecener: -6053.34834770 hartree
twoeener: 2133.74449991 hartree
kineticenergy: 2820.02515106 hartree
exchangeener: -82.471541681463 hartree
correlationener: -5.573962352215 hartree
xcener: -88.045504033678 hartree
dispersion: -0.018797257 hartree
energy: -12408.1749 -1611.3057 -1446.4742 -1446.4482 -1446.4422 -410.3971 -410.3966 -293.9326 -293.9304 -293.9057 -293.9012 -291.7928 -291.7902 -291.6587 -291.6576 -234.0526 -176.5880 -176.4644 -176.4444 -74.6661 -74.6455 -74.6078 -74.4759 -74.4698 -39.3149 -37.8026 -32.8587 -32.2362 -32.1112 -30.5366 -29.7520 -28.1840 -27.6408 -27.5684 -25.5685 -24.4586 -24.3252 -23.6681 -23.5477 -23.2264 -22.6724 -21.6703 -21.5166 -21.2033 -21.1339 -20.3748 -20.2006 -19.8177 -19.7469 -19.5752 -19.4716 -19.4553 -19.3301 -19.3267 -19.0594 -18.9772 -17.2871 -12.5595 -8.5084 -8.4781 -4.8899 -4.4738 -4.0377 -3.9250 -3.6768 -3.5031 -3.3032 -2.8274 -2.7196 -2.3913 -2.2543 -2.1104 -1.9309 -1.8886 -1.7050 -1.6119 -1.5655 -1.4517 -1.3055 -1.2988 -1.2510 -0.8639 -0.8522 -0.3572 -0.1663 -0.0110 0.2819 0.6487 0.8336 2.3007 3.4999 3.7055 4.3292 4.4769 5.3515 5.5325 5.8435 6.1192 6.3327 6.6394 6.9799 7.4840 7.5873 7.6523 8.1691 8.7590 9.0728 9.0983 9.7255 9.7596 10.0828 10.5978 10.9493 11.0061 11.4882 11.8727 13.2042 13.8462 14.9966 15.6533 16.3584 18.1714 18.6632 18.7354 18.9576 18.9973 19.0456 19.2183 19.5010 20.2301 20.5347 20.5701 20.6994 20.7544 20.9368 21.2433 21.4195 21.5935 21.6851 21.8381 21.9456 22.2612 22.5292 23.2163 23.2675 23.3082 23.6758 24.1790 24.7033 27.2177 27.5997 29.2413 29.6925 30.4331 30.7469 33.5833 34.0365 34.5983 35.8972 36.0684 36.1861 37.4167 37.6466 39.5495 40.0421 42.2701 43.3244 43.6189 43.6715 44.5707 45.2937 45.8544 46.0161 46.1166 46.3799 46.5132 46.5921 46.9182 48.4559 49.0565 49.2266 50.7739 51.5334 52.6116 52.7290 53.7745 55.2098 55.8708 55.9166 56.2293 56.4692 57.8181 57.9115 58.4095 58.6509 58.7864 58.9256 59.0947 59.4545 62.3352 62.4137 64.1637 64.3979 66.0428 66.3642 67.4638 67.5912 76.9434 77.7962 80.0423 85.0717 85.3091 362.4274 362.9869 363.8255 364.3028 370.3975 370.9648 371.7888 373.2590 513.0178 513.3889 electronvolt
chargesum: 2.0000000
charge: -0.666639 -0.366356 -0.510025 -0.317493 -0.768841 1.171565 -0.510107 -0.317398 -0.768915 -0.366333 -0.665048 0.324922 0.225704 0.287435 0.302015 0.340847 0.329814 0.332519 0.271964 0.359309 0.268933 0.329514 0.332846 0.359485 0.268581 0.272328 0.301651 0.340509 0.225973 0.286898 0.324340
charge: -0.365645 -0.152991 -0.136037 -0.141060 -0.395084 0.961731 -0.136061 -0.140869 -0.395064 -0.152903 -0.365056 0.188109 0.133923 0.164102 0.161057 0.181209 0.181521 0.182007 0.157113 0.203929 0.156927 0.181368 0.182109 0.203996 0.156719 0.157332 0.160624 0.180990 0.134235 0.163920 0.187849
qa: -0.6666 -0.3664 -0.5100 -0.3175 -0.7688 1.1716 -0.5101 -0.3174 -0.7689 -0.3663 -0.6650 0.3249 0.2257 0.2874 0.3020 0.3408 0.3298 0.3325 0.2720 0.3593 0.2689 0.3295 0.3328 0.3595 0.2686 0.2723 0.3017 0.3405 0.2260 0.2869 0.3243
va: 3.6284 3.5102 3.1535 3.5206 3.6378 2.9932 3.1536 3.5199 3.6375 3.5100 3.6284 0.8698 0.9110 0.8859 0.8678 0.8536 0.8500 0.8463 0.8858 0.8541 0.8879 0.8503 0.8461 0.8540 0.8879 0.8857 0.8680 0.8536 0.9109 0.8861 0.8701
dispersion: -0.018809586 hartree
energy: -2825.192129080111 hartree
dipole: -2.44949 2.34390 -0.10559 8.62473 -8.23309 0.39164 10.20042 -9.73776 0.46266
magnitude: 0.61530 au
magnitude: 1.56396 debye
