program: Orca
programVersion: 5.0.4
elementType: N Se F F N C C C C C C H H H H H H H H
charge: 0
multiplicity: 1
keywords: Opt RIJCOSX PBEh-3c
formula: C6H8F2N2Se
InChI: InChI=1/C6H8F2N2Se/c7-11(8,9)10-6-4-2-1-3-5-6/h1-5,10H,9H2
19 atoms
N  3.593952 -0.987043 -0.464895
Se 2.449339 0.299834 0.036971
F  3.095964 1.239835 -1.391064
F  1.76799 -0.904983 1.193508
N  0.933405 0.088387 -0.989773
C  -0.340285 0.153621 -0.369737
C  -0.920515 -0.997818 0.150631
C  -2.183946 -0.941673 0.715021
C  -2.884804 0.255499 0.756633
C  -2.312495 1.403539 0.231001
C  -1.041686 1.355236 -0.319841
H  3.259644 -1.916508 -0.246427
H  3.896281 -0.893609 -1.425479
H  1.014004 0.730524 -1.770014
H  -0.384924 -1.934131 0.095862
H  -2.628166 -1.842313 1.117666
H  -3.873639 0.291664 1.193536
H  -2.849619 2.342305 0.258915
H  -0.5905 2.257633 -0.716413
totalener: -2941.95588547 hartree
nucrepener: 1005.26414966 hartree
electener: -3947.22003513 hartree
oneelecener: -6085.12332785 hartree
twoeener: 2137.90329272 hartree
kineticenergy: 2936.47703684 hartree
exchangeener: -86.027488324875 hartree
correlationener: -5.542608446866 hartree
xcener: -91.570096771741 hartree
dispersion: -0.011640430 hartree
dispersion: -0.011648667 hartree
dispersion: -0.011646552 hartree
dispersion: -0.011647189 hartree
energy: -12398.9740 -1601.9305 -1437.1316 -1437.0801 -1437.0352 -681.5845 -681.4341 -399.1519 -398.9021 -285.5246 -284.4964 -284.4696 -284.4165 -284.3939 -284.3406 -224.6782 -167.2297 -167.1398 -166.9714 -65.3806 -65.2885 -65.1438 -65.1022 -65.0395 -34.4505 -34.0604 -28.3086 -27.1211 -25.8237 -23.0169 -22.7622 -21.0049 -18.9434 -18.4675 -16.5981 -16.2751 -15.7566 -15.2146 -14.6473 -14.5703 -13.8699 -13.7201 -13.2848 -12.2309 -12.2065 -12.0412 -11.9672 -11.6223 -11.3001 -11.1874 -10.4630 -9.3102 -9.1778 -8.1688 -7.6055 -0.0599 0.3517 1.1154 2.1430 2.4278 3.7354 4.0879 4.4664 5.1014 5.3921 5.7111 5.7438 6.5142 6.6285 7.4833 8.4678 8.7720 9.4604 9.7995 10.7670 12.3785 12.7063 13.0744 13.3299 13.9013 14.2218 14.6847 15.3347 15.5993 15.7359 16.0892 16.7726 16.8494 17.0034 17.2633 17.6408 17.7372 18.3230 18.8033 19.0907 19.5810 19.9885 21.3236 21.8930 23.6676 24.6977 25.3572 25.4322 25.7082 25.9304 26.0735 26.3998 26.6385 27.1440 27.5778 27.7668 28.3093 28.6332 29.1511 29.3725 29.7351 30.1571 31.1490 31.8095 32.3066 34.3395 34.6356 34.6840 34.8337 35.0151 35.0624 35.5598 35.6368 36.0631 36.3799 37.0406 37.2597 38.1724 39.1991 40.1156 40.5108 40.6192 41.4914 41.9825 42.2378 42.5957 43.8854 44.5781 45.2478 46.7663 47.5353 48.4621 49.7334 50.6108 50.9765 51.4142 51.6233 53.2308 54.5872 55.0211 56.2629 57.8924 58.3970 59.2637 59.4018 59.8003 60.2745 61.4214 62.4055 63.0450 63.8760 64.7024 66.2144 66.7644 68.3910 69.5030 70.3187 71.5654 72.8073 74.6503 75.0245 75.8217 76.7587 77.9427 78.8892 80.7624 85.3820 90.1383 92.3580 93.6545 94.8445 95.3903 97.9785 359.9295 371.7929 372.0794 384.7949 385.2175 396.5686 519.8499 526.7401 886.4241 893.7312 electronvolt
chargesum: -0.0000000
charge: -0.893077 1.388307 -0.531462 -0.505849 -0.829822 0.279012 -0.215826 -0.224916 -0.222222 -0.218789 -0.269752 0.372832 0.373587 0.372633 0.233080 0.222764 0.222652 0.223262 0.223587
charge: -0.546099 1.013247 -0.442168 -0.409428 -0.381881 -0.021209 -0.121117 -0.129835 -0.136167 -0.130961 -0.153059 0.251095 0.251276 0.258805 0.146406 0.138469 0.137564 0.138122 0.136941
qa: -0.8931 1.3883 -0.5315 -0.5058 -0.8298 0.2790 -0.2158 -0.2249 -0.2222 -0.2188 -0.2698 0.3728 0.3736 0.3726 0.2331 0.2228 0.2227 0.2233 0.2236
va: 2.7638 3.4607 0.7998 0.8361 2.7937 3.7163 3.8418 3.8161 3.8134 3.8267 3.8009 0.8458 0.8460 0.8465 0.9114 0.9104 0.9106 0.9107 0.9114
dispersion: -0.011647450 hartree
energy: -2941.916817233257 hartree
dipole: -26.96276 26.51202 -0.45074 -3.66296 3.48166 -0.18130 -1.78486 1.38312 -0.40174
magnitude: 0.63042 au
magnitude: 1.60239 debye
