program: Orca
programVersion: 5.0.4
elementType: N Se F F N C C C C C C H H H H H H H H
charge: 0
multiplicity: 1
keywords: SP DSD-BLYP D3BJ def2-QZVPP def2-QZVPP/C def2/J TightSCF
formula: C6H8F2N2Se
InChI: InChI=1/C6H8F2N2Se/c7-11(8,9)10-6-4-2-1-3-5-6/h1-5,10H,9H2
19 atoms
N  2.568896 -1.125788 -0.426084
Se 1.424282 0.161089 0.075783
F  2.070908 1.101089 -1.352253
F  0.742934 -1.043728 1.23232
N  -0.091651 -0.050358 -0.950962
C  -1.365341 0.014876 -0.330926
C  -1.945572 -1.136563 0.189443
C  -3.209002 -1.080418 0.753832
C  -3.909861 0.116754 0.795444
C  -3.337552 1.264794 0.269812
C  -2.066743 1.216491 -0.281029
H  2.234588 -2.055253 -0.207616
H  2.871225 -1.032355 -1.386668
H  -0.011053 0.591779 -1.731203
H  -1.40998 -2.072876 0.134673
H  -3.653222 -1.981058 1.156477
H  -4.898695 0.152919 1.232347
H  -3.874675 2.20356 0.297726
H  -1.615557 2.118888 -0.677601
totalener: -2942.12631676 hartree
nucrepener: 1005.44905549 hartree
electener: -3947.57537225 hartree
oneelecener: -6085.39655342 hartree
twoeener: 2137.82118117 hartree
kineticenergy: 2939.20586564 hartree
exchangeener: -47.515681066915 hartree
correlationener: -2.329084253599 hartree
xcener: -49.844765320515 hartree
chargesum: 0.0000000
charge: -0.531614 1.350996 -0.559600 -0.534533 -0.516181 0.216081 -0.053094 -0.104481 -0.103006 -0.106567 -0.111106 0.199214 0.199305 0.187161 0.094965 0.093900 0.093050 0.093238 0.092270
charge: 0.377952 0.712389 -0.238643 -0.193860 0.297963 -0.300614 0.074734 0.069594 0.064622 0.064469 0.062297 -0.234968 -0.236078 -0.229131 -0.055231 -0.058144 -0.060265 -0.059031 -0.058056
qa: -0.5316 1.3510 -0.5596 -0.5345 -0.5162 0.2161 -0.0531 -0.1045 -0.1030 -0.1066 -0.1111 0.1992 0.1993 0.1872 0.0950 0.0939 0.0930 0.0932 0.0923
va: 3.0143 3.4398 0.6582 0.6903 2.9245 3.5994 3.7467 3.8269 3.8277 3.8365 3.7680 1.0245 1.0253 1.0262 1.0005 0.9871 0.9875 0.9868 0.9870
total: -2943.395253420 hartree
dispersion: -0.015385424 hartree
energy: -2943.410638844051 hartree
dipole: -26.96276 26.43938 -0.52338 -3.66296 3.47495 -0.18802 -1.78486 1.45256 -0.33231
magnitude: 0.64785 au
magnitude: 1.64670 debye
