program: Orca
programVersion: 5.0.4
elementType: N Se N C C C C C C O H H H H H H H H
charge: 0
multiplicity: 1
keywords: Freq RIJCOSX PBEh-3c
frequency: 0.00 0.00 0.00 0.00 0.00 0.00 49.90 68.01 103.46 206.16 241.27 252.38 303.94 325.79 415.90 433.00 502.17 567.00 606.55 629.86 648.37 732.75 781.21 792.94 826.96 875.99 886.55 957.06 1010.59 1020.64 1040.80 1043.02 1053.44 1090.58 1144.86 1214.77 1243.52 1300.32 1354.16 1406.99 1442.19 1556.22 1589.12 1648.90 1706.29 1727.51 3251.38 3266.71 3275.67 3282.24 3293.50 3554.99 3609.06 3672.87
frequency: 49.90 68.01 103.46 206.16 241.27 252.38 303.94 325.79 415.90 433.00 502.17 567.00 606.55 629.86 648.37 732.75 781.21 792.94 826.96 875.99 886.55 957.06 1010.59 1020.64 1040.80 1043.02 1053.44 1090.58 1144.86 1214.77 1243.52 1300.32 1354.16 1406.99 1442.19 1556.22 1589.12 1648.90 1706.29 1727.51 3251.38 3266.71 3275.67 3282.24 3293.50 3554.99 3609.06 3672.87
formula: C6H8N2OSe
InChI: InChI=1/C6H8N2OSe/c7-10(9)8-6-4-2-1-3-5-6/h1-5,8H,7H2
18 atoms
N  3.084081 0.841955 0.078883
Se 2.403406 -0.676215 -0.688526
N  1.123161 -0.855753 0.638723
C  -0.168031 -0.35524 0.427917
C  -1.279222 -1.189259 0.546925
C  -2.557044 -0.685514 0.372251
C  -2.747626 0.649696 0.048896
C  -1.642983 1.478613 -0.080174
C  -0.361094 0.991423 0.119433
O  3.351404 -1.935433 -0.372632
H  3.863828 1.220244 -0.448951
H  3.363038 0.694608 1.044568
H  1.148437 -1.814324 0.970498
H  -1.140597 -2.239645 0.775743
H  -3.406774 -1.34712 0.477387
H  -3.745635 1.039489 -0.097193
H  -1.778405 2.525045 -0.320729
H  0.490053 1.657531 0.05928
totalener: -2817.67781424 hartree
nucrepener: 814.98566188 hartree
electener: -3632.66347612 hartree
oneelecener: -5529.51866364 hartree
twoeener: 1896.85518752 hartree
kineticenergy: 2812.92269024 hartree
exchangeener: -79.331844892816 hartree
correlationener: -5.050437861627 hartree
xcener: -84.382282754443 hartree
energy: -12398.0891 -1601.1634 -1436.3388 -1436.3306 -1436.2771 -529.5426 -399.0971 -398.7561 -285.5974 -284.4238 -284.3902 -284.3697 -284.2350 -284.2137 -223.9723 -166.4933 -166.4824 -166.3007 -64.6413 -64.6138 -64.4725 -64.4296 -64.3841 -30.0269 -27.9306 -26.5991 -25.6814 -22.9501 -22.4805 -20.0510 -18.9134 -18.2870 -16.4588 -15.8551 -15.1709 -14.5627 -14.1275 -13.6407 -13.3513 -13.1679 -12.1084 -11.6781 -11.4905 -10.9743 -10.1270 -9.7962 -8.9684 -8.4001 -8.1177 -7.0721 0.0357 0.3384 1.0976 1.8240 3.0459 3.6831 4.1059 4.2093 5.1248 5.4568 5.6631 5.7379 6.5288 6.7571 7.6828 8.6776 8.8499 9.3700 9.9427 10.6983 12.0431 12.5273 12.9190 13.8254 14.2781 14.7381 15.2396 15.5085 15.7625 15.9781 16.2393 16.8916 16.9166 17.0895 17.1691 17.5273 17.7573 18.2224 19.0880 19.2421 19.8498 20.8066 22.1065 22.8742 23.4154 24.0918 24.7097 25.4262 25.6482 25.9084 26.4371 26.5408 27.0832 27.5313 28.2588 28.5103 28.6945 28.7988 29.3302 29.7648 29.9916 30.4417 30.9624 31.2496 31.6510 33.3884 33.5732 34.8098 35.4979 35.7943 38.6908 39.6458 40.7563 41.3252 41.8322 42.0839 42.2771 42.7292 47.2979 47.7248 48.0011 49.1785 50.2711 51.1883 51.5347 51.9206 52.6952 53.2160 53.6279 55.0431 56.0633 56.5107 57.5139 57.9896 58.4767 59.4243 59.5063 59.9113 60.0161 61.8645 62.3376 62.9207 64.6259 64.8242 65.7135 67.0814 68.3076 69.2662 69.4975 71.5171 72.4921 74.5470 75.0747 75.7660 76.8767 78.3659 80.3312 85.5985 88.8877 89.8841 91.1679 94.1158 94.8033 96.9559 359.9377 371.9086 372.2100 384.9000 385.2934 396.3970 518.7984 526.4785 695.5936 electronvolt
chargesum: 0.0000000
charge: -0.910008 1.099035 -0.839861 0.338135 -0.292606 -0.212735 -0.234290 -0.213370 -0.282831 -0.682003 0.355582 0.368266 0.368157 0.217066 0.221519 0.219235 0.221134 0.259575
charge: -0.590222 0.842727 -0.383375 -0.003335 -0.165550 -0.123374 -0.154281 -0.122029 -0.164519 -0.573301 0.239220 0.245535 0.257052 0.134553 0.137549 0.136179 0.137235 0.149937
qa: -0.9100 1.0990 -0.8399 0.3381 -0.2926 -0.2127 -0.2343 -0.2134 -0.2828 -0.6820 0.3556 0.3683 0.3682 0.2171 0.2215 0.2192 0.2211 0.2596
va: 2.7150 3.5865 2.7767 3.6759 3.8146 3.8460 3.8159 3.8329 3.7756 1.8747 0.8437 0.8434 0.8478 0.9124 0.9107 0.9120 0.9114 0.9058
dispersion: -0.011113381 hartree
energy: -2817.652995784057 hartree
dipole: -23.12455 22.85625 -0.26830 7.57765 -6.88451 0.69315 8.97537 -9.00703 -0.03165
magnitude: 0.74393 au
magnitude: 1.89093 debye
temp: 298.15 k
press: 1.00 atm
zeropoint: 0.14126360 hartree
thermalvibcorrection: 0.00688967 hartree
thermalrotcorrection: 0.00141627 hartree
thermaltrasncorrection: 0.00141627 hartree
thermaltotal: -2817.50200997 hartree
thermalcorr: 0.00972222 hartree
nonthermalcorr: 0.14126360 hartree
totalcorr: 0.15098582 hartree
thermalcorrenthalpy: 0.00094421 hartree
totalenthalpy: -2817.50106576 hartree
vibrat: 0.01168471 hartree
rotat: 0.01450813 hartree
transl: 0.01987473 hartree
total: 0.04606756 hartree
totalentropycorr: -0.04606756 hartree
gibbsenthalpy: -2817.54713332 hartree
gibbsminuselec: 0.10586246 hartree
