program: Gaussian 09
title: 000076462
version: EM64L-G09RevD.01
frameworkgroup: C1[X(C10H12O2)]
method: RPBEPBE
basis: SDD
operation: Freq
keyword: #pfreq=noraman
keyword: PBEPBE/SDD
title: #p freq=noraman PBEPBE/SDD
converged: YES YES NO NO
title: Mulliken charges:
elementType: O O C C C C C C C C C C H H H H H H H H H H H H
charge: -0.285588 -0.229975 0.525865 -0.530558 -0.498346 -0.435806 0.362577 -0.673995 -0.192406 -0.410268 0.256590 -0.749496 0.206809 0.215117 0.304733 0.235375 0.228642 0.217279 0.220651 0.227911 0.255610 0.251835 0.245744 0.251700
chargesum: 0.00000
title: Mulliken charges with hydrogens summed into heavy atoms:
elementType: O O C C C C C C C C C C
charge: -0.285588 -0.229975 0.525865 -0.108632 -0.193612 -0.200432 0.362577 -0.007423 0.035505 -0.154658 0.256590 -0.000217
polarizability: 1.53129771e+02 -2.54472649e+00 1.25831285e+02 3.94859115e+00 5.94338784e+00 6.42851690e+01
1716.lowfreq: -11.6609 -7.0391 0.0008 0.0008 0.0010 6.9377 26.4240 32.5043 68.2326
frequency: 26.3285 32.4664 68.2062 86.5319 124.1617 141.9853 214.6231 250.4114 278.7699 313.6857 320.6188 394.9318 453.5257 511.8027 513.2561 552.5741 614.5201 653.7840 696.4204 706.0156 784.4058 803.5465 829.9796 904.9068 913.0636 930.2558 978.5956 980.5321 986.7744 1002.3330 1039.3887 1052.3782 1063.3272 1097.6660 1132.2728 1172.6962 1182.2872 1234.1042 1243.6160 1303.6678 1313.9285 1382.4654 1384.8982 1387.2127 1432.1825 1452.1559 1454.2317 1470.4435 1471.6010 1480.0720 1490.1546 1597.5039 1605.3904 1655.0474 2980.3639 2991.1414 3008.3757 3042.2668 3079.1535 3085.6883 3096.6912 3125.0418 3144.3253 3147.8698 3172.7548 3192.4969
redmass: 3.2537 3.7647 1.7181 1.6273 3.3841 3.2442 1.2464 4.8257 2.7300 3.4423 4.7476 2.6790 3.1690 4.5519 4.2790 3.1167 4.2936 6.4071 4.0322 2.4060 1.2026 1.4924 4.5842 1.3827 3.8972 1.3836 1.3544 2.2398 5.8183 1.9496 1.6402 1.5870 1.9735 1.4430 1.9738 1.1134 3.7168 2.4086 1.3503 1.2993 1.4882 1.3935 3.9602 1.2549 2.7266 1.0640 1.0468 1.2083 1.2306 1.4998 1.1039 6.2728 6.8446 9.5704 1.0347 1.0599 1.0366 1.1018 1.1001 1.1013 1.0974 1.0877 1.1011 1.0929 1.0974 1.0927
irintensity: 1.1935 2.0671 2.2345 1.2870 0.6415 2.7124 0.8050 0.4884 1.6922 0.4353 1.2506 0.6033 5.5885 10.8404 1.9579 0.9558 0.4632 5.6145 9.4452 24.7985 6.7561 47.7653 12.1434 0.8277 44.9657 23.4360 0.7697 5.9681 5.7329 105.3331 9.2233 5.1372 11.9664 8.7513 107.7782 4.8773 460.1966 32.9541 14.6358 10.3498 0.8020 37.7459 24.0790 9.7198 39.2207 27.7705 18.4553 4.6356 29.4730 23.3611 14.5014 47.6752 16.6403 186.2327 37.6713 33.2760 1.8511 7.2917 54.3868 40.6153 7.1791 8.7972 11.1423 21.0802 8.7074 3.9669
temp: 298.150 k
press: 1.00000 atm
elementType: 8 8 6 6 6 6 6 6 6 6 6 6 1 1 1 1 1 1 1 1 1 1 1 1
symmnumber: 1
zpe: 509811.8 jmol-1
zpe.correction: 0.194177 hartree
zpe.thermalcorrener: 0.206480 hartree
zpe.thermalcorrenthalpy: 0.207424 hartree
zpe.thermalcorrgfe: 0.153784 hartree
zpe.sumelectzpe: -537.828196 hartree
zpe.sumelectthermal: -537.815893 hartree
zpe.sumelectthermalent: -537.814949 hartree
zpe.sumelectthermalfe: -537.868589 hartree
dipole: 0.0599 1.3708 0.3283
dipole: 1.4108
quadrupole: -56.6158 -71.2717 -73.6220
quadrupole: 2.6960 1.6266 0.3786
quadrupole: 10.5541 -4.1019 -6.4522 2.6960 1.6266 0.3786
hfenergy: -538.022373 hartree
pointgroup: C01 [X(C10H12O2)]
dipole: 0.05784 0.5398526 0.1153728 debye
dipolederiv: -1.6538645 0.6364598 0.0751696 0.9701313 -0.9993545 -0.0999624 0.1004945 -0.0966691 -0.197224 -0.5820922 -0.2338914 -0.0325363 0.3700959 -0.9981255 -0.0945483 0.0459603 -0.0981068 -0.3058127 0.2073523 0.177126 -0.0156118 0.2260306 0.2245368 0.0062892 -0.0009815 0.0165726 -0.077134 0.104313 -0.0548361 0.0208513 -0.0799953 0.0280506 0.030886 0.1147495 0.1069193 0.0856492 -0.389575 -0.0553474 0.0106422 -0.0698435 -0.1247774 0.0093075 -0.0076836 -0.0000111 -0.159509 -0.0336842 -0.0457163 0.0103911 -0.1592007 -0.1858915 0.016988 -0.0219823 0.003339 -0.1753635 1.2179898 -0.3908584 -0.0488802 -0.24281 0.2734877 0.0227533 -0.0090568 0.0174208 0.1056937 0.022607 -0.0417739 0.0145962 -0.0382962 0.0341889 0.0439514 -0.0637546 -0.0218469 0.0104467 0.1008434 -0.0217978 0.0053311 -0.0273769 0.1440164 0.0318848 0.0050748 0.0361359 -0.1299329 -0.2419185 0.0998649 0.0231725 0.1639944 -0.1281956 0.0202967 0.022311 0.01136 -0.1915279 1.5675939 -0.1542264 -0.0061 -1.1122125 1.6964002 0.1926953 -0.1227398 0.1930518 0.2319166 -0.4755166 -0.0288788 -0.0097749 -0.1309762 -0.0124455 -0.0067489 -0.0235671 -0.0044937 0.0184947 -0.1167671 0.0270666 -0.0896295 0.0894535 0.0057368 0.0745746 -0.0607336 0.0346594 0.024796 0.0303637 0.0393918 0.0810812 -0.014028 -0.0467129 -0.1045304 0.0255769 -0.0887544 -0.0465416 0.1808352 0.0074489 -0.0090324 -0.0041325 0.0265816 -0.0188266 -0.0080578 -0.0197387 0.1624639 -0.1219383 0.0534056 -0.0033667 0.0328863 0.0897363 -0.0141199 -0.0055384 -0.0106261 0.1495413 -0.0669674 0.1062086 -0.0877107 0.0742393 0.0601616 0.050701 -0.0469731 0.0292357 0.0351454 -0.0732691 -0.1756884 0.0039048 -0.191642 -0.0833031 0.0149989 0.0103826 0.0137902 0.0625643 0.0764991 0.0411997 0.0596494 0.0844904 -0.020448 -0.1257187 0.0485989 -0.0660052 -0.0443642 0.0596961 0.055039 0.004838 0.0518671 -0.1180983 -0.0303348 0.0026449 -0.0339585 0.1503458 0.0106414 -0.0901986 -0.0150896 -0.0856599 0.0387903 -0.0192035 -0.0156287 -0.020474 0.1735038 0.0762383 -0.0037268 0.0121994 -0.014599 0.0475742 0.1022613 0.0521194 0.090483 0.0184466 0.0211028 0.051584 0.0048628 0.1056597 -0.0428586 -0.0193632 0.0101316 -0.0200522 0.1262386 0.0795169 0.0021453 -0.0089575 0.0019241 0.0909493 -0.0842311 -0.0513469 -0.0722309 -0.0278366 unknown
polarizability: 152.9810481|-3.4206285|126.3285185|-2.1125849|4.862319|63.936658 unknown
InChI: InChI=1S/C10H12O2/c1-3-9-5-4-6-10(7-9)12-8(2)11/h4-7H,3H2,1-2H3
charge 0 multiplicity 1
24 atoms
O  1.963492 0.326018 -0.121739
O  2.031813 -2.012233 -0.427808
C  -1.806894 -0.114619 -0.269774
C  -2.868916 -1.199183 -0.394952
C  -0.432815 -0.473671 -0.284217
C  -2.169253 1.244333 -0.099893
C  0.544782 0.533314 -0.124039
C  -3.166305 -1.890104 0.963425
C  -1.176244 2.2390 0.058316
C  0.188711 1.8899 0.04782
C  2.610746 -0.917395 -0.272461
C  4.106868 -0.696411 -0.214802
H  -3.805074 -0.762299 -0.79138
H  -2.53873 -1.965782 -1.121645
H  -0.134584 -1.514516 -0.420755
H  -3.229421 1.524227 -0.094611
H  -2.255033 -2.363371 1.37129
H  -3.937818 -2.673061 0.84585
H  -3.527428 -1.157577 1.707885
H  -1.464109 3.28813 0.186304
H  0.977789 2.638474 0.164734
H  4.420576 -0.009909 -1.020202
H  4.625307 -1.659725 -0.322948
H  4.385341 -0.22584 0.743904
