program: Orca
programVersion: 5.0.4
elementType: N Se N C C C C C C O H H H H H H H H
charge: 0
multiplicity: 1
keywords: SP DSD-BLYP D3BJ def2-QZVPP def2-QZVPP/C def2/J TightSCF
formula: C6H8N2OSe
InChI: InChI=1/C6H8N2OSe/c7-10(9)8-6-4-2-1-3-5-6/h1-5,8H,7H2
18 atoms
N  2.119329 1.197036 0.229341
Se 1.438654 -0.321133 -0.538068
N  0.158409 -0.500671 0.789181
C  -1.132783 -0.000159 0.578375
C  -2.243974 -0.834178 0.697383
C  -3.521796 -0.330433 0.522709
C  -3.712378 1.004777 0.199354
C  -2.607735 1.833694 0.070284
C  -1.325846 1.346504 0.269891
O  2.386652 -1.580351 -0.222174
H  2.899076 1.575325 -0.298493
H  2.398286 1.049689 1.195027
H  0.183685 -1.459242 1.120956
H  -2.105349 -1.884564 0.926201
H  -4.371526 -0.992039 0.627845
H  -4.710387 1.39457 0.053265
H  -2.743157 2.880126 -0.17027
H  -0.474699 2.012612 0.209738
totalener: -2817.80314500 hartree
nucrepener: 814.98566215 hartree
electener: -3632.78880715 hartree
oneelecener: -5529.59442721 hartree
twoeener: 1896.80562007 hartree
kineticenergy: 2815.05107836 hartree
exchangeener: -43.794812020642 hartree
correlationener: -2.113294727703 hartree
xcener: -45.908106748345 hartree
chargesum: -0.0000000
charge: -0.539457 1.061671 -0.532757 0.165374 -0.089130 -0.096861 -0.118062 -0.099457 -0.080479 -0.692414 0.158555 0.198543 0.197816 0.077718 0.092505 0.091948 0.096334 0.108153
charge: 0.341843 0.738036 0.299826 -0.308641 0.063399 0.063940 0.055480 0.064144 0.054221 -0.363238 -0.249267 -0.236361 -0.218833 -0.060808 -0.057593 -0.063320 -0.057598 -0.065232
qa: -0.5395 1.0617 -0.5328 0.1654 -0.0891 -0.0969 -0.1181 -0.0995 -0.0805 -0.6924 0.1586 0.1985 0.1978 0.0777 0.0925 0.0919 0.0963 0.1082
va: 2.9217 3.6311 2.8458 3.6952 3.7430 3.8303 3.8313 3.8161 3.7237 1.7608 1.0425 1.0265 1.0171 0.9910 0.9867 0.9888 0.9850 0.9899
total: -2818.924653722 hartree
dispersion: -0.014899725 hartree
energy: -2818.939553446698 hartree
dipole: -23.12455 22.59179 -0.53276 7.57765 -6.70297 0.87468 8.97537 -8.99736 -0.02199
magnitude: 1.02440 au
magnitude: 2.60381 debye
