program: Orca
programVersion: 5.0.4
elementType: N C C C C C C Se N C C C C C C O H H H H H H H H H H H H
charge: 0
multiplicity: 1
keywords: Freq RIJCOSX PBEh-3c
frequency: 0.00 0.00 0.00 0.00 0.00 0.00 11.64 31.01 42.51 72.08 90.28 99.24 181.10 222.00 240.99 269.84 290.26 389.13 392.02 432.00 432.23 494.43 503.70 561.68 591.06 601.83 617.31 645.70 647.06 731.87 733.58 778.31 788.20 825.49 835.89 870.53 876.22 885.90 887.53 957.82 960.41 1013.82 1019.45 1021.12 1040.96 1043.48 1043.81 1044.74 1088.33 1089.98 1141.52 1143.97 1214.78 1214.89 1238.88 1242.01 1294.43 1297.61 1338.38 1350.43 1402.93 1405.68 1428.01 1439.84 1551.24 1554.99 1586.01 1589.26 1705.78 1707.93 1724.41 1728.24 3251.83 3260.60 3263.12 3267.93 3274.32 3276.35 3281.49 3285.14 3293.57 3293.72 3584.78 3611.57
frequency: 11.64 31.01 42.51 72.08 90.28 99.24 181.10 222.00 240.99 269.84 290.26 389.13 392.02 432.00 432.23 494.43 503.70 561.68 591.06 601.83 617.31 645.70 647.06 731.87 733.58 778.31 788.20 825.49 835.89 870.53 876.22 885.90 887.53 957.82 960.41 1013.82 1019.45 1021.12 1040.96 1043.48 1043.81 1044.74 1088.33 1089.98 1141.52 1143.97 1214.78 1214.89 1238.88 1242.01 1294.43 1297.61 1338.38 1350.43 1402.93 1405.68 1428.01 1439.84 1551.24 1554.99 1586.01 1589.26 1705.78 1707.93 1724.41 1728.24 3251.83 3260.60 3263.12 3267.93 3274.32 3276.35 3281.49 3285.14 3293.57 3293.72 3584.78 3611.57
formula: C12H12N2OSe
InChI: InChI=1/C12H12N2OSe/c15-16(13-11-7-3-1-4-8-11)14-12-9-5-2-6-10-12/h1-10,13-14H
28 atoms
N  1.069193 -0.744332 0.523805
C  2.223425 0.033176 0.300694
C  2.097297 1.270036 -0.329051
C  3.217484 2.051861 -0.559873
C  4.470119 1.626726 -0.142497
C  4.595736 0.403043 0.498086
C  3.48414 -0.3978 0.705499
Se 0.271111 -1.454833 -0.984846
N  -1.281163 -1.896468 -0.076562
C  -2.344512 -0.983121 -0.039503
C  -2.158583 0.288577 0.503017
C  -3.214181 1.185247 0.546034
C  -4.470267 0.827312 0.079776
C  -4.660757 -0.442935 -0.443938
C  -3.605962 -1.337143 -0.517734
O  0.888645 -2.912333 -1.253567
H  1.180956 -1.452686 1.244453
H  1.116117 1.628128 -0.615468
H  3.106205 3.009585 -1.050983
H  5.340618 2.24595 -0.311103
H  5.56789 0.059664 0.826305
H  3.595278 -1.365789 1.178613
H  -1.548292 -2.840828 -0.333906
H  -1.195856 0.561618 0.914629
H  -3.055189 2.168504 0.969057
H  -5.29307 1.527348 0.128794
H  -5.634906 -0.739586 -0.809941
H  -3.761773 -2.31882 -0.949989
totalener: -3048.22200017 hartree
nucrepener: 1439.88516722 hartree
electener: -4488.10716739 hartree
oneelecener: -7084.33661759 hartree
twoeener: 2596.22945020 hartree
kineticenergy: 3041.63041662 hartree
exchangeener: -97.480988573771 hartree
correlationener: -6.795756021005 hartree
xcener: -104.276744594777 hartree
energy: -12398.2280 -1601.2920 -1436.4679 -1436.4579 -1436.4061 -529.7273 -399.1614 -399.1320 -285.6655 -285.6646 -284.5180 -284.5166 -284.4899 -284.4699 -284.4570 -284.4525 -284.4415 -284.3692 -284.3038 -284.2863 -224.0956 -166.6142 -166.6042 -166.4243 -64.7598 -64.7339 -64.5972 -64.5524 -64.5082 -30.2228 -28.0481 -27.9539 -25.8943 -25.7297 -23.0804 -23.0230 -22.7856 -22.3929 -20.2907 -19.0453 -18.9799 -18.5079 -18.2647 -16.5684 -16.4823 -15.5058 -15.2227 -14.8111 -14.6120 -14.0904 -13.7674 -13.7073 -13.4094 -13.3314 -13.2463 -12.2238 -12.0347 -11.6456 -11.5464 -11.5176 -11.1782 -11.0476 -10.2261 -9.7302 -9.4582 -8.7391 -8.2450 -8.1953 -7.3701 -7.1640 -0.1048 0.1440 0.2603 0.3571 1.1040 1.6718 2.9792 3.6872 3.7802 4.0418 4.1180 5.0487 5.3274 5.4907 5.5779 5.6537 5.7662 6.1862 6.5026 6.6173 6.6972 7.5238 7.6792 8.2749 8.6610 8.7199 9.0976 9.4870 9.6769 9.9021 10.2247 10.7340 11.7180 12.2126 12.4352 12.7103 13.9722 14.1234 14.2281 14.5074 14.7897 15.1607 15.3859 15.6359 15.8104 15.9076 16.0543 16.2668 16.4926 16.7520 16.7836 16.8512 16.8575 17.0052 17.0812 17.3288 17.3579 17.5859 17.6604 17.8067 18.1650 18.5080 19.0081 19.1354 19.4514 19.8484 20.1691 20.5618 20.8783 22.1183 22.3834 24.0478 24.1348 25.0166 25.2822 25.5381 25.6334 25.8053 25.8928 26.0085 26.3804 26.5326 26.8833 27.0155 27.4525 27.6162 28.1602 28.4539 28.5427 28.8310 29.0707 29.2801 29.4142 29.5514 29.8297 29.9638 30.2772 30.6703 31.1610 31.3039 31.4372 32.4164 32.9250 33.1659 33.9355 34.8581 35.1134 35.2525 35.5015 35.6451 36.1694 37.2885 38.5852 39.8144 40.2127 40.8424 41.2804 41.7282 41.8362 41.9622 42.1266 42.2358 42.3146 42.6458 42.6835 46.7277 47.3020 48.8817 49.2369 49.6555 50.3500 51.1036 51.1607 51.3432 51.7361 51.9633 52.4824 52.8983 53.3836 54.1216 54.8390 54.9627 56.0477 56.1817 56.4057 57.4787 57.7665 58.2451 58.4601 58.9009 59.0363 59.2935 59.5615 59.9234 60.0007 60.1027 61.3996 61.7227 62.5772 62.7012 64.1702 64.5045 64.6600 64.7905 65.3638 65.9034 67.8561 68.4720 68.9317 69.2204 69.6320 71.2157 71.5015 72.4999 72.7862 74.4672 74.4767 74.9270 75.0924 75.6932 75.7279 76.7103 76.8087 78.1290 78.2933 80.3376 80.6287 85.3294 85.5850 89.8393 90.4057 91.6624 94.3817 94.7334 94.7992 97.4220 359.8578 359.9765 371.6815 371.8542 372.0534 372.3281 384.7029 384.8445 385.1280 385.3609 396.3691 396.4196 526.1282 526.8384 695.9741 electronvolt
chargesum: 0.0000000
charge: -0.840453 0.322140 -0.263667 -0.214463 -0.229106 -0.215037 -0.274641 1.109329 -0.839547 0.334966 -0.288246 -0.212090 -0.234183 -0.212936 -0.290135 -0.666772 0.366868 0.234916 0.223558 0.222652 0.225376 0.226045 0.368989 0.262800 0.222499 0.220786 0.222753 0.217599
charge: -0.388942 -0.013024 -0.155034 -0.123666 -0.145858 -0.122815 -0.153993 0.873245 -0.384669 -0.004384 -0.165320 -0.122249 -0.152419 -0.122989 -0.164299 -0.560668 0.255691 0.141277 0.138721 0.137761 0.139140 0.139645 0.257815 0.149523 0.137780 0.136765 0.138042 0.134923
qa: -0.8405 0.3221 -0.2637 -0.2145 -0.2291 -0.2150 -0.2746 1.1093 -0.8395 0.3350 -0.2882 -0.2121 -0.2342 -0.2129 -0.2901 -0.6668 0.3669 0.2349 0.2236 0.2227 0.2254 0.2260 0.3690 0.2628 0.2225 0.2208 0.2228 0.2176
va: 2.7771 3.6571 3.8134 3.8351 3.8140 3.8298 3.8126 3.5710 2.7783 3.6744 3.7810 3.8295 3.8153 3.8434 3.8138 1.8959 0.8454 0.9071 0.9102 0.9107 0.9097 0.9089 0.8465 0.9030 0.9110 0.9115 0.9103 0.9123
dispersion: -0.019645416 hartree
energy: -3048.191708744700 hartree
dipole: -3.42186 3.10889 -0.31296 17.74380 -17.06141 0.68239 11.52902 -11.31913 0.20989
magnitude: 0.77952 au
magnitude: 1.98139 debye
temp: 298.15 k
press: 1.00 atm
zeropoint: 0.22472340 hartree
thermalvibcorrection: 0.01130707 hartree
thermalrotcorrection: 0.00141627 hartree
thermaltrasncorrection: 0.00141627 hartree
thermaltotal: -3047.95284573 hartree
thermalcorr: 0.01413962 hartree
nonthermalcorr: 0.22472340 hartree
totalcorr: 0.23886301 hartree
thermalcorrenthalpy: 0.00094421 hartree
totalenthalpy: -3047.95190152 hartree
vibrat: 0.02028069 hartree
rotat: 0.01583740 hartree
transl: 0.02032542 hartree
total: 0.05644350 hartree
totalentropycorr: -0.05644350 hartree
gibbsenthalpy: -3048.00834503 hartree
gibbsminuselec: 0.18336372 hartree
