program: Orca
programVersion: 5.0.4
elementType: N C C C C C C Se F N C C C C C C C C C C C C H H H H H H H H H H H H H H H H
charge: 1
multiplicity: 1
keywords: Opt RIJCOSX PBEh-3c
formula: C18H16FN2Se
InChI: InChI=1/C18H16FN2Se/c19-22(20-16-10-4-1-5-11-16)21(17-12-6-2-7-13-17)18-14-8-3-9-15-18/h1-15,20H
38 atoms
N  1.560151 -0.439963 0.14977
C  2.984666 -0.315708 0.292815
C  3.744824 -0.09461 -0.847083
C  5.120808 0.024652 -0.73049
C  5.725035 -0.090953 0.512754
C  4.956634 -0.318631 1.64629
C  3.57916 -0.421312 1.543819
Se 0.638099 1.041973 0.209818
F  0.565772 1.373435 1.921123
N  -0.961255 0.438438 -0.13126
C  -1.893944 1.393221 -0.666252
C  -2.964589 1.807286 0.113918
C  -3.872749 2.708609 -0.414932
C  -3.700816 3.201405 -1.702176
C  -2.625317 2.785521 -2.471502
C  -1.720263 1.867385 -1.959489
C  -1.38573 -0.877981 0.236342
C  -1.431519 -1.269207 1.569686
C  -1.857828 -2.552369 1.881995
C  -2.249458 -3.423021 0.87628
C  -2.21216 -3.016526 -0.450871
C  -1.770569 -1.745762 -0.778265
H  1.110967 -1.290196 0.487422
H  3.267273 -0.037592 -1.816702
H  5.720928 0.195885 -1.613292
H  6.799464 -0.005788 0.599634
H  5.429562 -0.408395 2.614271
H  2.97563 -0.587773 2.426996
H  -3.092503 1.42187 1.117051
H  -4.714012 3.033017 0.181617
H  -4.410979 3.908766 -2.107617
H  -2.496645 3.161794 -3.476884
H  -0.901919 1.507963 -2.571984
H  -1.16516 -0.578768 2.359547
H  -1.900067 -2.862923 2.916816
H  -2.591678 -4.417686 1.12662
H  -2.523141 -3.692804 -1.23507
H  -1.736372 -1.42315 -1.810617
totalener: -3303.12355049 hartree
nucrepener: 2268.97709949 hartree
electener: -5572.10064998 hartree
oneelecener: -9057.66993737 hartree
twoeener: 3485.56928739 hartree
kineticenergy: 3294.52611556 hartree
exchangeener: -116.510748624876 hartree
correlationener: -8.559698970945 hartree
xcener: -125.070447595821 hartree
dispersion: -0.029405455 hartree
dispersion: -0.029460405 hartree
dispersion: -0.029535925 hartree
dispersion: -0.029469947 hartree
dispersion: -0.029458898 hartree
dispersion: -0.029453419 hartree
dispersion: -0.029458178 hartree
dispersion: -0.029468517 hartree
dispersion: -0.029469548 hartree
dispersion: -0.029474625 hartree
dispersion: -0.029473028 hartree
dispersion: -0.029476239 hartree
dispersion: -0.029467801 hartree
dispersion: -0.029468878 hartree
dispersion: -0.029472868 hartree
dispersion: -0.029480409 hartree
dispersion: -0.029479220 hartree
chargesum: 1.0000000
charge: -0.845330 0.245456 -0.232022 -0.218725 -0.203877 -0.218757 -0.230732 1.356388 -0.417130 -0.815340 0.279341 -0.218577 -0.218341 -0.204743 -0.218407 -0.259078 0.250671 -0.282296 -0.222620 -0.206235 -0.221891 -0.213010 0.432484 0.251356 0.259741 0.262793 0.261294 0.249710 0.254178 0.261941 0.263009 0.259679 0.243465 0.267637 0.262938 0.265080 0.263410 0.256539
charge: -0.336405 -0.047736 -0.127363 -0.111454 -0.099994 -0.109524 -0.130531 1.102862 -0.325683 -0.194715 -0.026999 -0.117526 -0.106651 -0.100982 -0.111270 -0.141775 -0.032396 -0.155384 -0.113904 -0.103453 -0.108140 -0.116424 0.290899 0.151147 0.155588 0.156468 0.155915 0.151579 0.155986 0.156538 0.156716 0.155596 0.146439 0.154870 0.156328 0.157412 0.157285 0.156680
qa: -0.8453 0.2455 -0.2320 -0.2187 -0.2039 -0.2188 -0.2307 1.3564 -0.4171 -0.8153 0.2793 -0.2186 -0.2183 -0.2047 -0.2184 -0.2591 0.2507 -0.2823 -0.2226 -0.2062 -0.2219 -0.2130 0.4325 0.2514 0.2597 0.2628 0.2613 0.2497 0.2542 0.2619 0.2630 0.2597 0.2435 0.2676 0.2629 0.2651 0.2634 0.2565
va: 2.8318 3.5554 3.8193 3.8074 3.7836 3.8063 3.7906 3.3351 0.9535 2.8797 3.5577 3.7939 3.8019 3.7839 3.8133 3.8093 3.5798 3.7842 3.8014 3.7809 3.8016 3.7921 0.7976 0.9005 0.8972 0.8956 0.8966 0.9027 0.9011 0.8965 0.8955 0.8974 0.9035 0.8999 0.8963 0.8948 0.8958 0.9001
dispersion: -0.029479675 hartree
energy: -3303.090363114268 hartree
dipole: -7.83530 7.93869 0.10339 -15.02525 14.62453 -0.40072 -5.07711 4.72409 -0.35302
magnitude: 0.54396 au
magnitude: 1.38263 debye
