program: Orca
programVersion: 5.0.4
elementType: N C C C C C C Se F F N C C C C C C C C C C C C H H H H H H H H H H H H H H H H
charge: 0
multiplicity: 1
keywords: Freq RIJCOSX PBEh-3c
frequency: 0.00 0.00 0.00 0.00 0.00 0.00 20.35 28.83 33.56 46.42 52.40 73.22 90.94 106.35 115.78 155.33 217.55 240.82 247.04 256.81 270.70 285.16 318.50 324.52 336.44 427.69 430.17 435.78 440.61 465.24 472.23 528.37 532.18 540.95 575.21 630.00 631.16 636.96 643.74 646.72 648.43 700.94 727.10 730.20 738.55 760.59 798.23 798.97 844.17 873.83 884.28 893.39 903.39 924.07 948.20 963.49 973.53 993.23 1016.72 1024.71 1029.89 1040.68 1042.69 1045.61 1047.31 1049.20 1049.82 1085.57 1089.07 1095.04 1135.30 1143.51 1154.20 1214.92 1215.05 1216.30 1230.81 1239.97 1251.11 1268.53 1298.53 1352.84 1366.02 1372.63 1388.20 1396.88 1401.84 1412.27 1430.62 1532.89 1540.35 1544.05 1584.83 1588.02 1591.48 1702.08 1703.80 1707.65 1718.58 1723.88 1727.28 3254.86 3255.54 3267.11 3268.49 3268.72 3277.23 3277.40 3278.78 3286.59 3290.05 3290.33 3296.21 3296.52 3299.39 3309.35 3649.96
frequency: 20.35 28.83 33.56 46.42 52.40 73.22 90.94 106.35 115.78 155.33 217.55 240.82 247.04 256.81 270.70 285.16 318.50 324.52 336.44 427.69 430.17 435.78 440.61 465.24 472.23 528.37 532.18 540.95 575.21 630.00 631.16 636.96 643.74 646.72 648.43 700.94 727.10 730.20 738.55 760.59 798.23 798.97 844.17 873.83 884.28 893.39 903.39 924.07 948.20 963.49 973.53 993.23 1016.72 1024.71 1029.89 1040.68 1042.69 1045.61 1047.31 1049.20 1049.82 1085.57 1089.07 1095.04 1135.30 1143.51 1154.20 1214.92 1215.05 1216.30 1230.81 1239.97 1251.11 1268.53 1298.53 1352.84 1366.02 1372.63 1388.20 1396.88 1401.84 1412.27 1430.62 1532.89 1540.35 1544.05 1584.83 1588.02 1591.48 1702.08 1703.80 1707.65 1718.58 1723.88 1727.28 3254.86 3255.54 3267.11 3268.49 3268.72 3277.23 3277.40 3278.78 3286.59 3290.05 3290.33 3296.21 3296.52 3299.39 3309.35 3649.96
formula: C18H16F2N2Se
InChI: InChI=1/C18H16F2N2Se/c19-23(20,21-16-10-4-1-5-11-16)22(17-12-6-2-7-13-17)18-14-8-3-9-15-18/h1-15,21H
39 atoms
N  1.758909 0.77307 0.418502
C  2.787893 -0.196711 0.34339
C  4.12002 0.203271 0.313362
C  5.135976 -0.740271 0.308014
C  4.828101 -2.091587 0.309877
C  3.499293 -2.491204 0.33526
C  2.481159 -1.553828 0.360964
Se 0.773114 1.315959 -1.009362
F  0.409106 2.773137 0.031743
F  1.143425 -0.272956 -1.75317
N  -0.913783 0.682034 -0.682944
C  -1.991314 1.58344 -0.795532
C  -3.002807 1.623872 0.159823
C  -4.06784 2.497785 0.010343
C  -4.135788 3.355988 -1.075261
C  -3.13254 3.312637 -2.03126
C  -2.080186 2.422436 -1.905891
C  -1.044603 -0.533271 0.033028
C  -1.362529 -1.693523 -0.662119
C  -1.500349 -2.892551 0.019049
C  -1.309905 -2.93887 1.393266
C  -0.986263 -1.782229 2.087664
C  -0.850965 -0.579926 1.410464
H  1.971013 1.579249 0.991699
H  4.364508 1.25873 0.28906
H  6.16806 -0.416279 0.28754
H  5.61867 -2.830034 0.293408
H  3.251193 -3.544333 0.341303
H  1.450343 -1.8748 0.403578
H  -2.969217 0.971416 1.020899
H  -4.846644 2.511824 0.761456
H  -4.964134 4.042946 -1.181608
H  -3.176825 3.960832 -2.896447
H  -1.339384 2.370345 -2.694658
H  -1.498374 -1.644791 -1.733514
H  -1.748799 -3.794222 -0.524802
H  -1.413165 -3.877001 1.922488
H  -0.833153 -1.8161 3.158032
H  -0.592416 0.325417 1.94206
totalener: -3403.02902516 hartree
nucrepener: 2560.98189711 hartree
electener: -5964.01092227 hartree
oneelecener: -9807.75675656 hartree
twoeener: 3843.74583429 hartree
kineticenergy: 3393.86614153 hartree
exchangeener: -122.328352123933 hartree
correlationener: -9.041612056272 hartree
xcener: -131.369964180205 hartree
chargesum: 0.0000000
charge: -0.857287 0.324418 -0.270469 -0.220886 -0.223129 -0.228306 -0.214350 1.397694 -0.514342 -0.484605 -0.823722 0.385325 -0.274822 -0.214327 -0.233173 -0.214575 -0.275540 0.258841 -0.209809 -0.235578 -0.218116 -0.235863 -0.228427 0.380072 0.219982 0.220819 0.220530 0.220556 0.260599 0.245802 0.220254 0.218094 0.220405 0.225147 0.238274 0.225668 0.225301 0.225805 0.243742
charge: -0.355690 -0.012907 -0.149567 -0.133373 -0.136376 -0.130619 -0.115666 1.027298 -0.432763 -0.389481 -0.219495 0.026287 -0.149009 -0.122815 -0.149438 -0.123064 -0.155313 -0.010942 -0.109121 -0.137817 -0.130293 -0.139307 -0.130213 0.265197 0.135859 0.137186 0.136569 0.137756 0.154681 0.147218 0.136977 0.135920 0.137421 0.137404 0.150704 0.139671 0.138556 0.139644 0.148923
qa: -0.8573 0.3244 -0.2705 -0.2209 -0.2231 -0.2283 -0.2143 1.3977 -0.5143 -0.4846 -0.8237 0.3853 -0.2748 -0.2143 -0.2332 -0.2146 -0.2755 0.2588 -0.2098 -0.2356 -0.2181 -0.2359 -0.2284 0.3801 0.2200 0.2208 0.2205 0.2206 0.2606 0.2458 0.2203 0.2181 0.2204 0.2251 0.2383 0.2257 0.2253 0.2258 0.2437
va: 2.8089 3.6620 3.8109 3.8323 3.8109 3.8254 3.8383 3.4700 0.8270 0.8704 2.8466 3.6682 3.8023 3.8416 3.8170 3.8518 3.8209 3.7679 3.8301 3.7965 3.8075 3.8111 3.7952 0.8431 0.9122 0.9114 0.9113 0.9116 0.8860 0.8993 0.9113 0.9120 0.9109 0.9096 0.9081 0.9101 0.9100 0.9109 0.9124
dispersion: -0.032193814 hartree
energy: -3402.986149359518 hartree
dipole: -10.44884 10.62004 0.17120 -19.51312 19.08477 -0.42835 15.02253 -14.60474 0.41779
magnitude: 0.62237 au
magnitude: 1.58194 debye
temp: 298.15 k
press: 1.00 atm
zeropoint: 0.30982981 hartree
thermalvibcorrection: 0.01701267 hartree
thermalrotcorrection: 0.00141627 hartree
thermaltrasncorrection: 0.00141627 hartree
thermaltotal: -3402.65647434 hartree
thermalcorr: 0.01984521 hartree
nonthermalcorr: 0.30982981 hartree
totalcorr: 0.32967502 hartree
thermalcorrenthalpy: 0.00094421 hartree
totalenthalpy: -3402.65553013 hartree
vibrat: 0.03009104 hartree
rotat: 0.01651504 hartree
transl: 0.02075185 hartree
total: 0.06735793 hartree
totalentropycorr: -0.06735793 hartree
gibbsenthalpy: -3402.72288806 hartree
gibbsminuselec: 0.26326130 hartree
