program: Orca
programVersion: 5.0.4
elementType: N C C C C C C Se F F N C C C C C C C C C C C C H H H H H H H H H H H H H H H H
charge: 0
multiplicity: 1
keywords: Opt RIJCOSX PBEh-3c
formula: C18H16F2N2Se
InChI: InChI=1/C18H16F2N2Se/c19-23(20,21-16-10-4-1-5-11-16)22(17-12-6-2-7-13-17)18-14-8-3-9-15-18/h1-15,21H
39 atoms
N  1.758909 0.77307 0.418502
C  2.787893 -0.196711 0.34339
C  4.12002 0.203271 0.313362
C  5.135976 -0.740271 0.308014
C  4.828101 -2.091587 0.309877
C  3.499293 -2.491204 0.33526
C  2.481159 -1.553828 0.360964
Se 0.773114 1.315959 -1.009362
F  0.409106 2.773137 0.031743
F  1.143425 -0.272956 -1.75317
N  -0.913783 0.682034 -0.682944
C  -1.991314 1.58344 -0.795532
C  -3.002807 1.623872 0.159823
C  -4.06784 2.497785 0.010343
C  -4.135788 3.355988 -1.075261
C  -3.13254 3.312637 -2.03126
C  -2.080186 2.422436 -1.905891
C  -1.044603 -0.533271 0.033028
C  -1.362529 -1.693523 -0.662119
C  -1.500349 -2.892551 0.019049
C  -1.309905 -2.93887 1.393266
C  -0.986263 -1.782229 2.087664
C  -0.850965 -0.579926 1.410464
H  1.971013 1.579249 0.991699
H  4.364508 1.25873 0.28906
H  6.168061 -0.416279 0.287539
H  5.61867 -2.830034 0.293408
H  3.251193 -3.544333 0.341303
H  1.450343 -1.8748 0.403578
H  -2.969217 0.971416 1.020899
H  -4.846644 2.511824 0.761456
H  -4.964134 4.042946 -1.181608
H  -3.176825 3.960832 -2.896447
H  -1.339384 2.370345 -2.694658
H  -1.498374 -1.644791 -1.733514
H  -1.748799 -3.794222 -0.524802
H  -1.413165 -3.877001 1.922488
H  -0.833153 -1.8161 3.158032
H  -0.592416 0.325417 1.94206
totalener: -3403.02855499 hartree
nucrepener: 2558.02263944 hartree
electener: -5961.05119443 hartree
oneelecener: -9801.54169972 hartree
twoeener: 3840.49050528 hartree
kineticenergy: 3393.85808315 hartree
exchangeener: -122.330162634910 hartree
correlationener: -9.042022923312 hartree
xcener: -131.372185558222 hartree
dispersion: -0.032296913 hartree
dispersion: -0.032261879 hartree
dispersion: -0.032303454 hartree
dispersion: -0.032302215 hartree
dispersion: -0.032322991 hartree
dispersion: -0.032338249 hartree
dispersion: -0.032329220 hartree
dispersion: -0.032366059 hartree
dispersion: -0.032450032 hartree
dispersion: -0.032537317 hartree
dispersion: -0.032476645 hartree
dispersion: -0.032421608 hartree
dispersion: -0.032473071 hartree
dispersion: -0.032442493 hartree
dispersion: -0.032355127 hartree
dispersion: -0.032326108 hartree
dispersion: -0.032332230 hartree
dispersion: -0.032331180 hartree
dispersion: -0.032307991 hartree
dispersion: -0.032269649 hartree
dispersion: -0.032225915 hartree
dispersion: -0.032194639 hartree
dispersion: -0.032197757 hartree
dispersion: -0.032202206 hartree
dispersion: -0.032198520 hartree
dispersion: -0.032194303 hartree
chargesum: 0.0000000
charge: -0.857548 0.324572 -0.270578 -0.220906 -0.223236 -0.228299 -0.214315 1.397651 -0.514275 -0.484529 -0.823794 0.385519 -0.274805 -0.214348 -0.233276 -0.214638 -0.275606 0.259221 -0.209851 -0.235632 -0.218307 -0.235899 -0.228450 0.380127 0.220010 0.220840 0.220568 0.220563 0.260617 0.245805 0.220268 0.218115 0.220422 0.225162 0.238269 0.225686 0.225339 0.225794 0.243743
charge: -0.355908 -0.012802 -0.149626 -0.133400 -0.136449 -0.130617 -0.115619 1.027261 -0.432705 -0.389414 -0.219544 0.026436 -0.148979 -0.122843 -0.149511 -0.123114 -0.155358 -0.010678 -0.109122 -0.137870 -0.130431 -0.139345 -0.130211 0.265237 0.135875 0.137199 0.136589 0.137763 0.154695 0.147220 0.136981 0.135933 0.137430 0.137412 0.150702 0.139675 0.138572 0.139644 0.148919
qa: -0.8575 0.3246 -0.2706 -0.2209 -0.2232 -0.2283 -0.2143 1.3977 -0.5143 -0.4845 -0.8238 0.3855 -0.2748 -0.2143 -0.2333 -0.2146 -0.2756 0.2592 -0.2099 -0.2356 -0.2183 -0.2359 -0.2285 0.3801 0.2200 0.2208 0.2206 0.2206 0.2606 0.2458 0.2203 0.2181 0.2204 0.2252 0.2383 0.2257 0.2253 0.2258 0.2437
va: 2.8087 3.6620 3.8109 3.8323 3.8109 3.8254 3.8384 3.4701 0.8271 0.8705 2.8465 3.6682 3.8023 3.8415 3.8169 3.8517 3.8209 3.7678 3.8301 3.7965 3.8075 3.8111 3.7952 0.8430 0.9122 0.9114 0.9113 0.9116 0.8860 0.8993 0.9113 0.9120 0.9109 0.9096 0.9081 0.9101 0.9100 0.9109 0.9124
dispersion: -0.032193814 hartree
energy: -3402.986149542694 hartree
dipole: -10.44884 10.61988 0.17104 -19.51312 19.08509 -0.42803 15.02253 -14.60522 0.41731
magnitude: 0.62178 au
magnitude: 1.58044 debye
