program: Orca
programVersion: 5.0.4
elementType: N C C C C C C Se F F N C C C C C C C C C C C C H H H H H H H H H H H H H H H H
charge: 0
multiplicity: 1
keywords: SP DSD-BLYP D3BJ def2-QZVPP def2-QZVPP/C def2/J TightSCF
formula: C18H16F2N2Se
InChI: InChI=1/C18H16F2N2Se/c19-23(20,21-16-10-4-1-5-11-16)22(17-12-6-2-7-13-17)18-14-8-3-9-15-18/h1-15,21H
39 atoms
N  1.572221 0.404577 0.700324
C  2.601205 -0.565204 0.625211
C  3.933331 -0.165222 0.595184
C  4.949287 -1.108764 0.589835
C  4.641413 -2.46008 0.591698
C  3.312605 -2.859697 0.617081
C  2.29447 -1.922321 0.642786
Se 0.586425 0.947466 -0.727541
F  0.222417 2.404644 0.313564
F  0.956737 -0.641449 -1.471349
N  -1.100471 0.313541 -0.401122
C  -2.178002 1.214947 -0.51371
C  -3.189495 1.255379 0.441644
C  -4.254528 2.129292 0.292164
C  -4.322476 2.987495 -0.79344
C  -3.319229 2.944144 -1.749439
C  -2.266875 2.053943 -1.62407
C  -1.231291 -0.901764 0.314849
C  -1.549217 -2.062016 -0.380298
C  -1.687037 -3.261044 0.30087
C  -1.496594 -3.307363 1.675087
C  -1.172951 -2.150722 2.369485
C  -1.037653 -0.948419 1.692285
H  1.784325 1.210756 1.27352
H  4.17782 0.890237 0.570881
H  5.981372 -0.784772 0.569361
H  5.431982 -3.198527 0.575229
H  3.064505 -3.912826 0.623125
H  1.263654 -2.243293 0.6854
H  -3.155906 0.602923 1.302721
H  -5.033333 2.143331 1.043277
H  -5.150822 3.674453 -0.899787
H  -3.363513 3.592339 -2.614626
H  -1.526073 2.001852 -2.412837
H  -1.685062 -2.013284 -1.451693
H  -1.935487 -4.162715 -0.242981
H  -1.599853 -4.245494 2.20431
H  -1.019842 -2.184593 3.439853
H  -0.779104 -0.043076 2.223881
totalener: -3402.82978589 hartree
nucrepener: 2560.98189750 hartree
electener: -5963.81168340 hartree
oneelecener: -9807.64639203 hartree
twoeener: 3843.83470863 hartree
kineticenergy: 3398.76832228 hartree
exchangeener: -67.763514025943 hartree
correlationener: -3.796568402579 hartree
xcener: -71.560082428522 hartree
chargesum: 0.0000000
charge: -0.510760 0.254872 -0.128708 -0.117010 -0.105462 -0.138133 -0.000165 1.228554 -0.556429 -0.527272 -0.351159 0.215430 -0.087441 -0.127794 -0.130046 -0.102659 -0.112842 0.261826 -0.107742 -0.125238 -0.132253 -0.122245 -0.063482 0.180131 0.087189 0.088232 0.091221 0.097015 0.103936 0.091004 0.095961 0.089473 0.089428 0.067532 0.111328 0.095870 0.094810 0.094020 0.109007
charge: 0.324472 -0.287036 0.065510 0.062860 0.063168 0.069260 0.081936 0.756514 -0.223881 -0.159898 0.195566 -0.270111 0.081906 0.067147 0.057782 0.065783 0.058017 -0.285809 0.089590 0.068289 0.066150 0.065086 0.074036 -0.224943 -0.058778 -0.059899 -0.060790 -0.058421 -0.048876 -0.055879 -0.057784 -0.063004 -0.057695 -0.064722 -0.047136 -0.058935 -0.058916 -0.059386 -0.051172
qa: -0.5108 0.2549 -0.1287 -0.1170 -0.1055 -0.1381 -0.0002 1.2286 -0.5564 -0.5273 -0.3512 0.2154 -0.0874 -0.1278 -0.1300 -0.1027 -0.1128 0.2618 -0.1077 -0.1252 -0.1323 -0.1222 -0.0635 0.1801 0.0872 0.0882 0.0912 0.0970 0.1039 0.0910 0.0960 0.0895 0.0894 0.0675 0.1113 0.0959 0.0948 0.0940 0.1090
va: 2.8888 3.4833 3.7738 3.8295 3.8255 3.8167 3.6693 3.4975 0.6697 0.7054 2.7257 3.5776 3.7086 3.8026 3.8379 3.8225 3.7542 3.5870 3.7671 3.8018 3.8375 3.8182 3.7096 1.0334 0.9903 0.9870 0.9853 0.9829 0.9878 1.0024 0.9813 0.9871 0.9854 1.0053 0.9922 0.9856 0.9884 0.9882 1.0058
total: -3405.085408334 hartree
dispersion: -0.039508841 hartree
energy: -3405.124917175404 hartree
dipole: -10.44884 10.55431 0.10547 -19.51312 19.05482 -0.45830 15.02253 -14.63608 0.38645
magnitude: 0.60869 au
magnitude: 1.54716 debye
