program: Orca
programVersion: 5.0.4
elementType: N C C C C C C Se N C C C C C C C C C C C C O H H H H H H H H H H H H H H H H
charge: 0
multiplicity: 1
keywords: Freq RIJCOSX PBEh-3c
frequency: 0.00 0.00 0.00 0.00 0.00 0.00 17.02 27.10 46.54 48.69 61.08 69.38 78.03 95.27 142.15 176.85 235.33 240.39 256.91 272.81 283.01 315.52 339.89 402.82 430.82 434.83 435.89 455.40 503.77 531.95 540.69 584.78 605.03 624.91 643.01 645.43 647.80 700.41 734.17 736.10 740.02 782.24 798.72 803.47 837.45 874.05 888.47 888.71 894.95 921.98 941.70 964.51 969.10 996.76 1006.40 1022.52 1028.81 1033.13 1040.80 1043.61 1044.11 1046.10 1047.02 1054.23 1087.13 1088.15 1094.51 1140.46 1140.77 1152.63 1214.00 1214.64 1216.76 1237.67 1238.37 1251.57 1267.28 1297.78 1340.00 1357.02 1375.70 1386.88 1400.31 1402.99 1412.71 1427.69 1533.16 1539.93 1548.94 1584.62 1586.66 1589.37 1695.60 1702.51 1705.31 1718.14 1722.63 1726.40 3262.96 3264.63 3265.28 3266.34 3271.22 3271.93 3275.12 3278.50 3281.98 3284.16 3285.79 3291.74 3292.91 3293.34 3304.17 3586.05
frequency: 17.02 27.10 46.54 48.69 61.08 69.38 78.03 95.27 142.15 176.85 235.33 240.39 256.91 272.81 283.01 315.52 339.89 402.82 430.82 434.83 435.89 455.40 503.77 531.95 540.69 584.78 605.03 624.91 643.01 645.43 647.80 700.41 734.17 736.10 740.02 782.24 798.72 803.47 837.45 874.05 888.47 888.71 894.95 921.98 941.70 964.51 969.10 996.76 1006.40 1022.52 1028.81 1033.13 1040.80 1043.61 1044.11 1046.10 1047.02 1054.23 1087.13 1088.15 1094.51 1140.46 1140.77 1152.63 1214.00 1214.64 1216.76 1237.67 1238.37 1251.57 1267.28 1297.78 1340.00 1357.02 1375.70 1386.88 1400.31 1402.99 1412.71 1427.69 1533.16 1539.93 1548.94 1584.62 1586.66 1589.37 1695.60 1702.51 1705.31 1718.14 1722.63 1726.40 3262.96 3264.63 3265.28 3266.34 3271.22 3271.93 3275.12 3278.50 3281.98 3284.16 3285.79 3291.74 3292.91 3293.34 3304.17 3586.05
formula: C18H16N2OSe
InChI: InChI=1/C18H16N2OSe/c21-22(19-16-10-4-1-5-11-16)20(17-12-6-2-7-13-17)18-14-8-3-9-15-18/h1-15,19H
38 atoms
N  1.578056 -1.575945 1.483975
C  2.224788 -0.866626 0.455744
C  3.139406 0.130595 0.791381
C  3.760016 0.870782 -0.20296
C  3.498195 0.608761 -1.540157
C  2.605416 -0.398793 -1.876156
C  1.960729 -1.124719 -0.887635
Se 0.342229 -0.638919 2.48307
N  -0.881567 -0.172548 1.169282
C  -1.077122 1.217022 0.963166
C  -0.046002 2.045357 0.533185
C  -0.27511 3.403164 0.355621
C  -1.532875 3.936624 0.586149
C  -2.566182 3.107984 1.004375
C  -2.339107 1.756366 1.19982
C  -1.329448 -1.097472 0.210058
C  -1.462214 -0.716195 -1.127319
C  -1.861231 -1.637156 -2.080431
C  -2.115665 -2.955909 -1.730844
C  -1.992018 -3.33338 -0.403503
C  -1.621717 -2.415955 0.56829
O  -0.331571 -1.821245 3.334288
H  1.207588 -2.480864 1.205971
H  3.374887 0.311515 1.832725
H  4.4652 1.644742 0.070279
H  3.991179 1.181077 -2.31438
H  2.394546 -0.614016 -2.915317
H  1.238622 -1.885543 -1.157132
H  0.930682 1.629203 0.317821
H  0.533386 4.040237 0.022372
H  -1.709926 4.993811 0.439659
H  -3.549952 3.518783 1.188825
H  -3.135107 1.105135 1.536336
H  -1.242909 0.300642 -1.424108
H  -1.962134 -1.319782 -3.11019
H  -2.419342 -3.674324 -2.480015
H  -2.208729 -4.351224 -0.106148
H  -1.584896 -2.721288 1.603903
totalener: -3278.76579469 hartree
nucrepener: 2325.03999818 hartree
electener: -5603.80579287 hartree
oneelecener: -9160.03047961 hartree
twoeener: 3556.22468673 hartree
kineticenergy: 3270.32014597 hartree
exchangeener: -115.632697504937 hartree
correlationener: -8.550693229622 hartree
xcener: -124.183390734559 hartree
chargesum: -0.0000000
charge: -0.822135 0.288952 -0.272130 -0.221173 -0.231669 -0.219854 -0.268641 1.149615 -0.817745 0.261469 -0.258251 -0.227072 -0.219988 -0.224702 -0.227025 0.325283 -0.267302 -0.223595 -0.236792 -0.219732 -0.335380 -0.669853 0.376853 0.238655 0.225608 0.223463 0.226325 0.248533 0.265489 0.224350 0.224447 0.226158 0.242198 0.251816 0.220526 0.219306 0.224795 0.299199
charge: -0.383387 -0.017746 -0.155209 -0.131484 -0.146494 -0.124671 -0.147270 0.896328 -0.241687 -0.011509 -0.146037 -0.129688 -0.133058 -0.129935 -0.123021 0.012453 -0.151406 -0.130837 -0.155082 -0.128949 -0.176820 -0.554910 0.259842 0.144143 0.139099 0.137896 0.139687 0.149036 0.151639 0.139165 0.138436 0.139799 0.149470 0.149883 0.136714 0.135933 0.138300 0.161376
qa: -0.8221 0.2890 -0.2721 -0.2212 -0.2317 -0.2199 -0.2686 1.1496 -0.8177 0.2615 -0.2583 -0.2271 -0.2200 -0.2247 -0.2270 0.3253 -0.2673 -0.2236 -0.2368 -0.2197 -0.3354 -0.6699 0.3769 0.2387 0.2256 0.2235 0.2263 0.2485 0.2655 0.2244 0.2244 0.2262 0.2422 0.2518 0.2205 0.2193 0.2248 0.2992
va: 2.7951 3.6936 3.8172 3.8276 3.8113 3.8306 3.7989 3.5416 2.8424 3.7209 3.7910 3.8217 3.8052 3.8074 3.8068 3.7032 3.7939 3.8408 3.8117 3.8190 3.7740 1.8891 0.8396 0.9056 0.9098 0.9107 0.9099 0.9034 0.8841 0.9112 0.9101 0.9097 0.9056 0.8996 0.9113 0.9120 0.9103 0.8936
dispersion: -0.032835393 hartree
energy: -3278.734652993546 hartree
dipole: -3.47825 3.77507 0.29682 9.07293 -8.05845 1.01448 -33.69131 32.38097 -1.31034
magnitude: 1.68352 au
magnitude: 4.27918 debye
temp: 298.15 k
press: 1.00 atm
zeropoint: 0.30802433 hartree
thermalvibcorrection: 0.01574190 hartree
thermalrotcorrection: 0.00141627 hartree
thermaltrasncorrection: 0.00141627 hartree
thermaltotal: -3278.40805422 hartree
thermalcorr: 0.01857445 hartree
nonthermalcorr: 0.30802433 hartree
totalcorr: 0.32659878 hartree
thermalcorrenthalpy: 0.00094421 hartree
totalenthalpy: -3278.40711001 hartree
vibrat: 0.02795510 hartree
rotat: 0.01636242 hartree
transl: 0.02066678 hartree
total: 0.06498430 hartree
totalentropycorr: -0.06498430 hartree
gibbsenthalpy: -3278.47209431 hartree
gibbsminuselec: 0.26255868 hartree
