program: Orca
programVersion: 5.0.4
elementType: N C C C C C C Se N C C C C C C C C C C C C O H H H H H H H H H H H H H H H H
charge: 0
multiplicity: 1
keywords: SP DSD-BLYP D3BJ def2-QZVPP def2-QZVPP/C def2/J TightSCF
formula: C18H16N2OSe
InChI: InChI=1/C18H16N2OSe/c21-22(19-16-10-4-1-5-11-16)20(17-12-6-2-7-13-17)18-14-8-3-9-15-18/h1-15,19H
38 atoms
N  1.52338 -1.37331 0.799938
C  2.170113 -0.663992 -0.228293
C  3.08473 0.33323 0.107344
C  3.70534 1.073417 -0.886997
C  3.443519 0.811396 -2.224193
C  2.55074 -0.196159 -2.560193
C  1.906053 -0.922085 -1.571671
Se 0.287553 -0.436285 1.799033
N  -0.936243 0.030086 0.485245
C  -1.131797 1.419657 0.279129
C  -0.100678 2.247992 -0.150851
C  -0.329786 3.605799 -0.328416
C  -1.587551 4.139259 -0.097888
C  -2.620858 3.310619 0.320338
C  -2.393783 1.959001 0.515783
C  -1.384124 -0.894837 -0.473979
C  -1.51689 -0.51356 -1.811356
C  -1.915906 -1.434521 -2.764468
C  -2.170341 -2.753274 -2.414881
C  -2.046694 -3.130746 -1.08754
C  -1.676393 -2.21332 -0.115747
O  -0.386247 -1.61861 2.650251
H  1.152912 -2.278229 0.521934
H  3.320211 0.51415 1.148688
H  4.410524 1.847377 -0.613758
H  3.936503 1.383712 -2.998417
H  2.33987 -0.411381 -3.599354
H  1.183946 -1.682908 -1.841169
H  0.876007 1.831838 -0.366216
H  0.47871 4.242872 -0.661665
H  -1.764601 5.196445 -0.244378
H  -3.604627 3.721418 0.504788
H  -3.189783 1.30777 0.852299
H  -1.297585 0.503277 -2.108145
H  -2.01681 -1.117147 -3.794227
H  -2.474018 -3.471689 -3.164052
H  -2.263405 -4.148589 -0.790185
H  -1.639572 -2.518653 0.919866
totalener: -3278.52075943 hartree
nucrepener: 2325.03999906 hartree
electener: -5603.56075848 hartree
oneelecener: -9160.19114753 hartree
twoeener: 3556.63038905 hartree
kineticenergy: 3274.61224959 hartree
exchangeener: -64.041907485102 hartree
correlationener: -3.581080086849 hartree
xcener: -67.622987571951 hartree
chargesum: 0.0000000
charge: -0.518227 0.197974 -0.108652 -0.104797 -0.123728 -0.116619 -0.064417 0.994658 -0.374453 0.260502 -0.116448 -0.127656 -0.123241 -0.106872 -0.128777 0.171452 -0.056076 -0.137935 -0.148230 -0.116493 -0.207174 -0.691457 0.184975 0.097485 0.095575 0.091472 0.100388 0.105569 0.131566 0.102816 0.093370 0.100902 0.111326 0.089475 0.097973 0.091019 0.108663 0.144093
charge: 0.297409 -0.312740 0.054446 0.061140 0.058571 0.068586 0.074396 0.827806 0.177690 -0.298544 0.067521 0.067744 0.066540 0.070040 0.085890 -0.274600 0.075181 0.058799 0.052205 0.059155 0.066539 -0.325480 -0.211929 -0.058686 -0.058400 -0.061567 -0.056994 -0.050995 -0.055118 -0.058276 -0.059467 -0.057887 -0.047625 -0.053427 -0.058954 -0.063749 -0.057020 -0.068199
qa: -0.5182 0.1980 -0.1087 -0.1048 -0.1237 -0.1166 -0.0644 0.9947 -0.3745 0.2605 -0.1164 -0.1277 -0.1232 -0.1069 -0.1288 0.1715 -0.0561 -0.1379 -0.1482 -0.1165 -0.2072 -0.6915 0.1850 0.0975 0.0956 0.0915 0.1004 0.1056 0.1316 0.1028 0.0934 0.1009 0.1113 0.0895 0.0980 0.0910 0.1087 0.1441
va: 2.8667 3.6406 3.7482 3.8127 3.8314 3.8340 3.7005 3.6514 2.6957 3.4885 3.7518 3.8206 3.8329 3.7893 3.7772 3.7346 3.6548 3.8090 3.8500 3.7755 3.7211 1.7707 1.0424 0.9847 0.9855 0.9909 0.9827 0.9837 0.9538 0.9815 0.9851 0.9821 0.9887 1.0034 0.9820 0.9903 0.9773 1.0124
total: -3280.630057118 hartree
dispersion: -0.040064699 hartree
energy: -3280.670121816544 hartree
dipole: -3.47825 3.83111 0.35286 9.07293 -7.97709 1.09584 -33.69131 32.28899 -1.40232
magnitude: 1.81435 au
magnitude: 4.61171 debye
